{"text_format":"1","workbook":"xlsx","n_sheets":6,"sheets":["Example 7.1","Example 7.2","Example 7.3","SteelProps","StlSubTables","StlSects"],"not_rendered":{"charts":0,"images":1,"macros":1,"external_links":0,"defined_names":7,"comments":0,"pivot_tables":0},"unopened":[],"bounds":{"document_bytes":16777216,"sheet_cells":100000,"rows_first":2000,"rows_last":500,"rows_between":2000,"halvings":0,"cell_chars":16384,"cell_head_chars":4096},"cells_cut":0,"cells_raw":0,"read":"whole","date_system":"1900"}

{"sheet":"Example 7.1","index":0,"n_rows":144,"n_cols":12,"rows_kept":144,"cut":false,"hidden":false,"merged":[[24,5,24,6]]}
["A Beginners Guide to the Steel Construction Manual, 16th Edition",null,null,null,null,null,null,"last modified:  29 May 2023"]
["Example 7.1",null,null,null,null,null,null,"by:  TBQ"]
[]
[]
[]
[]
[]
[]
[]
[]
[]
[]
[null,"Load","Part of Ps,eq"]
[null,"Dead,D",1,null,null,"(Lc)x",15,"ft"]
[null,"Live, L",1.5,null,null,"(Lc)y",6,"ft"]
[null,"Snow, S",2]
[]
[]
[]
[]
[]
["Solution:"]
[]
["Solution Summary:"]
[null,null,null,null,null,"Ps,eq"]
[null,null,null,null,null,"LRFD","ASD"]
["Part","Section",null,"Steel",null,"(kips)","(kips)"]
["a",{"$f":"+B43","v":"W10X19"},null,{"$f":"+B44","v":"A992"},null,{"$f":"+C76","v":117.43830163790537},{"$f":"+H76","v":127.17296068344079}]
["b",{"$f":"+B78","v":"HSS10X4X1/2"},null,{"$f":"+B79","v":"A500 Gr B, Rect HSS"},null,{"$f":"+C110","v":301.28001874599397},{"$f":"+H110","v":326.25362802695571}]
["c",{"$f":"+B112","v":"HSS7.500X0.500"},null,{"$f":"+B113","v":"A500 Gr B, Rnd HSS"},null,{"$f":"+C144","v":215.42697544234068},{"$f":"+H144","v":233.2840810534903}]
[]
["ASCE 7 Load Combinations:"]
[]
[null,"Load",null,"Part of Ps,eq"]
[null,"Dead,D",null,{"$f":"+C14","v":1},{"$f":"+D35/(SUM(D$35:D$37))","v":0.22222222222222221},"Ps,eq"]
[null,"Live, L",null,{"$f":"+C15","v":1.5},{"$f":"+D36/(SUM(D$35:D$37))","v":0.33333333333333331},"Ps,eq"]
[null,"Snow, S",null,{"$f":"+C16","v":2},{"$f":"+D37/(SUM(D$35:D$37))","v":0.44444444444444442},"Ps,eq"]
[]
["The controlling load case is LRFD LC-3c",null,null,null,null,null,"The controlling load case is ASD LC-4 and LC-6 equally control"]
["Composite load factor for LRFD:",null,null,"Pu =",{"$f":"1.2*E35+1.6*E37+1*E36","v":1.3111111111111111},"Ps,eq","Composite load factor for ASD:",null,null,"Ps =",{"$f":"1*E35+0.75*(E36+E37)","v":0.80555555555555547},"Ps,eq"]
[]
[]
["part (a)","W10X19",null,"Fy",{"$f":"VLOOKUP(B44,StlProp,2)","v":50},"ksi"]
[null,"A992",null,"Orient column so that the strong axis is associated with the largest KL"]
[]
[null,{"$f":"IF(OR(G66>1,G67>1),\"Sender Elements:  Use SCM Section E7\",\"Use SCM Section E3\")","v":"Use SCM Section E3"}]
[]
[null,"Compute Slenderness Values"]
[null,"Direction","r","Lc/r"]
[null,null,"(in)"]
[null,"Strong",{"$f":"VLOOKUP(B43,StlSects,33)","v":4.1399999999999997},{"$f":"12*G14/C51","v":43.478260869565219},{"$f":"IF(D51>D52,\"<--- Controlling Value\",\" \")","v":" "}]
[null,"Weak",{"$f":"VLOOKUP(B43,StlSects,37)","v":0.874},{"$f":"12*G15/C52","v":82.379862700228827},{"$f":"IF(D52>D51,\"<--- Controlling Value\",\" \")","v":"<--- Controlling Value"}]
[]
[null,"Determine Pn"]
[null,null,"Determine SCM Section E3 formula to use"]
[]
[null,null,"4.71sqrt(E/Fy)",null,{"$f":"4.71*SQRT(29000/E43)","v":113.43182093222343}]
[null,null,"Controlling Lc/r",null,{"$f":"MAX(D51:D52)","v":82.379862700228827}]
[null,null,"(Lc/r)/limit",null,{"$f":"+E58/E57","v":0.72625002422778318},{"$f":"IF(E59<=1,\"Use SCM Equation E3-2\",\"Use SCM Equation E3-3\")","v":"Use SCM Equation E3-2"}]
[]
[null,null,"Fe",{"$f":"+(PI()^2)*29000/(E58^2)","v":42.175050928454773},"ksi"]
[null,null,"Fn",{"$f":"IF(E59<1,E43*0.658^(E43/D61),0.877*D61)","v":30.441807462925251},"ksi"]
[]
[null,"Check Local Buckling Criteria:  SCM Table B4.1 and SCM E7"]
[null,"Case","Coeff.","Ratio","Actual","Limit","Act/Limit"]
[null,1,0.56000000000000005,"bf/2tf",{"$f":"VLOOKUP(B43,StlSects,25)","v":5.09},{"$f":"0.56*SQRT(29000/E43)*SQRT(E43/D62)","v":17.284300512643032},{"$f":"+E66/F66","v":0.29448689556611174},{"$f":"IF(G66<=1,\"Not Slender\",\"SLENDER!!!\")","v":"Not Slender"}]
[null,5,1.49,"h/tw",{"$f":"VLOOKUP(B43,StlSects,27)","v":35.4},{"$f":"+F66*1.49/0.56","v":45.988585292568068},{"$f":"+E67/F67","v":0.76975622917717312},{"$f":"IF(G67<=1,\"Not Slender\",\"SLENDER!!!\")","v":"Not Slender"}]
[]
[null,null,"Ae = Ag",{"$f":"VLOOKUP(B43,StlSects,5)","v":5.62},"in^2"]
[null,null,"Pn",{"$f":"+D62*D69","v":171.0829579416399},"kips"]
[]
[null,"LRFD",null,null,null,null,"ASD"]
[null,"fc =",0.9,null,null,null,"Wc =",1.67]
[null,"Pu  <",{"$f":"+D70*C73","v":153.97466214747593},"kips",null,null,"Pa  <",{"$f":"+D70/H73","v":102.44488499499396},"kips"]
[null,"CLF",{"$f":"+E$40","v":1.3111111111111111},null,null,null,"CLF",{"$f":"+K$40","v":0.80555555555555547}]
[null,"Ps,eq <",{"$f":"+C74/C75","v":117.43830163790537},"kips/connection",null,null,"Ps,eq <",{"$f":"+H74/H75","v":127.17296068344079},"kips/connection"]
[]
["part (b)","HSS10X4X1/2",null,"Fy",{"$f":"VLOOKUP(B79,StlProp,2)","v":46},"ksi"]
[null,"A500 Gr B, Rect HSS"]
[]
[null,"Use SCM Section E3"]
[]
[null,"Compute Slenderness Values"]
[null,"Direction","r","Lc/r"]
[null,null,"(in)"]
[null,"Strong",{"$f":"VLOOKUP(B78,StlSects,33)","v":3.34},{"$f":"12*G$14/C86","v":53.892215568862277},{"$f":"IF(D86>D87,\"<--- Controlling Value\",\" \")","v":"<--- Controlling Value"}]
[null,"Weak",{"$f":"VLOOKUP(B78,StlSects,37)","v":1.59},{"$f":"12*G$15/C87","v":45.283018867924525},{"$f":"IF(D87>D86,\"<--- Controlling Value\",\" \")","v":" "}]
[]
[null,"Determine Pn"]
[null,null,"Determine SCM Section E3 formula to use"]
[]
[null,null,"4.71sqrt(E/Fy)",null,{"$f":"4.71*SQRT(29000/E78)","v":118.26084838554797}]
[null,null,"Controlling Lc/r",null,{"$f":"MAX(D86:D87)","v":53.892215568862277}]
[null,null,"(Lc/r)/limit",null,{"$f":"+E93/E92","v":0.45570631620336116}]
[]
[null,null,"Fe",{"$f":"+(PI()^2)*29000/(E93^2)","v":98.547512557005575},"ksi"]
[null,null,"Fn",{"$f":"IF(E94<1,E78*0.658^(E78/D96),0.877*D96)","v":37.836358250348326},"ksi"]
[]
[null,"Check Local Buckling Criteria:  SCM Table B4.1 and SCM E7"]
[null,"Case","Coeff.","Ratio","Actual","Limit","Act/Limit"]
[null,6,1.4,"b/t",{"$f":"MAX(VLOOKUP(B78,StlSects,26),VLOOKUP(B78,StlSects,28))","v":18.5},{"$f":"C101*SQRT(29000/E78)*SQRT(E78/D97)","v":38.75898274464884},{"$f":"+E101/F101","v":0.4773087085871508},{"$f":"IF(G101<=1,\"Not Slender\",\"SLENDER!!!\")","v":"Not Slender"}]
[]
[null,null,"Ae = Ag",{"$f":"VLOOKUP(B78,StlSects,5)","v":11.6},"in^2"]
[null,null,"Pn",{"$f":"+D97*D103","v":438.90175570404057},"kips"]
[]
[null,"LRFD",null,null,null,null,"ASD"]
[null,"fc =",0.9,null,null,null,"Wc =",1.67]
[null,"Pu  <",{"$f":"+D104*C107","v":395.01158013363653},"kips",null,null,"Pa  <",{"$f":"+D104/H107","v":262.81542257726983},"kips"]
[null,"CLF",{"$f":"+E$40","v":1.3111111111111111},null,null,null,"CLF",{"$f":"+K$40","v":0.80555555555555547}]
[null,"Ps,eq <",{"$f":"+C108/C109","v":301.28001874599397},"kips/connection",null,null,"Ps,eq <",{"$f":"+H108/H109","v":326.25362802695571},"kips/connection"]
[]
["part (c)","HSS7.500X0.500",null,"Fy",{"$f":"VLOOKUP(B113,StlProp,2)","v":42},"ksi"]
[null,"A500 Gr B, Rnd HSS"]
[]
[null,{"$f":"IF(G135>1,\"Sender Elements:  Use SCM Section E7\",\"Use SCM Section E3\")","v":"Use SCM Section E3"}]
[]
[null,"Compute Slenderness Values"]
[null,"Direction","r","Lc/r"]
[null,null,"(in)"]
[null,"Strong",{"$f":"VLOOKUP(B112,StlSects,33)","v":2.4900000000000002},{"$f":"12*G$14/C120","v":72.289156626506013},{"$f":"IF(D120>D121,\"<--- Controlling Value\",\" \")","v":"<--- Controlling Value"}]
[null,"Weak",{"$f":"VLOOKUP(B112,StlSects,37)","v":2.4900000000000002},{"$f":"12*G$15/C121","v":28.915662650602407},{"$f":"IF(D121>D120,\"<--- Controlling Value\",\" \")","v":" "}]
[]
[null,"Determine Pn"]
[null,null,"Determine SCM Section E3 formula to use"]
[]
[null,null,"4.71sqrt(E/Fy)",null,{"$f":"4.71*SQRT(29000/E112)","v":123.76426324728337}]
[null,null,"Controlling Lc/r",null,{"$f":"MAX(D120:D121)","v":72.289156626506013}]
[null,null,"(Lc/r)/limit",null,{"$f":"+E127/E126","v":0.5840874799381377},{"$f":"IF(E128<=1,\"Use SCM Equation E3-2\",\"Use SCM Equation E3-3\")","v":"Use SCM Equation E3-2"}]
[]
[null,null,"Fe",{"$f":"+(PI()^2)*29000/(E127^2)","v":54.771095468167601},"ksi"]
[null,null,"Fn",{"$f":"IF(E128<1,E112*0.658^(E112/D130),0.877*D130)","v":30.46911554859906},"ksi"]
[]
[null,"Check Local Buckling Criteria:  SCM Table B4.1 and SCM E7"]
[null,"Case","Coeff.","Ratio","Actual","Limit","Act/Limit"]
[null,9,0.11,"D/t",{"$f":"VLOOKUP(B112,StlSects,29)","v":16.100000000000001},{"$f":"C135*(29000/E112)","v":75.952380952380949},{"$f":"+E135/F135","v":0.21197492163009407},{"$f":"IF(G135<=1,\"Not Slender\",\"SLENDER!!!\")","v":"Not Slender"}]
[]
[null,null,"Ae = Ag",{"$f":"VLOOKUP(B112,StlSects,5)","v":10.3},"in^2"]
[null,null,"Pn",{"$f":"+D131*D137","v":313.83189015057036},"kips"]
[]
[null,"LRFD",null,null,null,null,"ASD"]
[null,"fc =",0.9,null,null,null,"Wc =",1.67]
[null,"Pu  <",{"$f":"+D138*C141","v":282.44870113551332},"kips",null,null,"Pa  <",{"$f":"+D138/H141","v":187.92328751531161},"kips"]
[null,"CLF",{"$f":"+E$40","v":1.3111111111111111},null,null,null,"CLF",{"$f":"+K$40","v":0.80555555555555547}]
[null,"Ps,eq <",{"$f":"+C142/C143","v":215.42697544234068},"kips/connection",null,null,"Ps,eq <",{"$f":"+H142/H143","v":233.2840810534903},"kips/connection"]

{"sheet":"Example 7.2","index":1,"n_rows":84,"n_cols":14,"rows_kept":84,"cut":false,"hidden":false,"merged":[]}
["A Beginners Guide to the Steel Construction Manual, 16th Edition",null,null,null,null,null,null,"last modified:  29 May 2023"]
["Example 7.2",null,null,null,null,null,null,"by:  TBQ"]
[]
[]
[]
[]
[]
[]
[]
[]
["Solution:"]
[]
["Determine the loads on the column:"]
[]
[null,"From the drawings, we find that the tributary area at each level is the same.  See the next drawing for "]
[null,"a view of the tributary area."]
[]
[]
[]
[]
[]
[]
[]
[]
[]
[]
[]
[]
[]
[]
[]
[]
[]
[]
[null,"Area Tributary to the column",null,null,72,"sqft per level (rounded up to the nearest integer.)"]
[null,"Length of Ext Wall supported",null,null,{"$f":"14+10/12","v":14.833333333333334},"ft"]
[null,null,null,null,null,null,null,"These appear to be the likely to control load cases:"]
[null,null,null,null,null,null,null,"LRFD Load Cases",null,null,"ASD Load Cases"]
["Level","Height","Flr D","Ext Wall D","Roof D","Flr L","Roof S","LC-1","LC-2","LC-3","LC-2","LC-3","LC-4"]
[null,"unit loads (psf):",60,50,50,40,50]
[null,"(ft)","(lb)","(lb)","(lb)","(lb)","(lb)","(lb)","(lb)","(lb)","(lb)","(lb)","(lb)"]
["Roof",1.3332999999999999,null,{"$f":"+B42*E36*D40","v":988.86416666666662},{"$f":"+E35*E40","v":3600},null,{"$f":"+G40*E35","v":3600},{"$f":"1.4*(C42+D42+E42)","v":6424.4098333333322},{"$f":"1.2*(C42+D42+E42)+1.6*F42+0.5*G42","v":7306.6369999999997},{"$f":"1.2*(C42+D42+E42)+1.6*G42+1*F42","v":11266.636999999999},{"$f":"+C42+D42+E42+F42","v":4588.8641666666663},{"$f":"+C42+D42+E42+G42","v":8188.8641666666663},{"$f":"+C42+D42+E42+0.75*(F42+G42)","v":7288.8641666666663}]
["3rd floor",11,{"$f":"+E35*C40","v":4320},{"$f":"+B43*E36*D40","v":8158.3333333333339},null,{"$f":"+E35*F40","v":2880},null,{"$f":"1.4*(C43+D43+E43)","v":17469.666666666668},{"$f":"1.2*(C43+D43+E43)+1.6*F43+0.5*G43","v":19582},{"$f":"1.2*(C43+D43+E43)+1.6*G43+1*F43","v":17854},{"$f":"+C43+D43+E43+F43","v":15358.333333333334},{"$f":"+C43+D43+E43+G43","v":12478.333333333334},{"$f":"+C43+D43+E43+0.75*(F43+G43)","v":14638.333333333334}]
["2nd floor",{"$f":"10+8/12","v":10.666666666666666},{"$f":"+C43","v":4320},{"$f":"+B44*E36*D40","v":7911.1111111111113},null,{"$f":"+F43","v":2880},null,{"$f":"1.4*(C44+D44+E44)","v":17123.555555555555},{"$f":"1.2*(C44+D44+E44)+1.6*F44+0.5*G44","v":19285.333333333336},{"$f":"1.2*(C44+D44+E44)+1.6*G44+1*F44","v":17557.333333333336},{"$f":"+C44+D44+E44+F44","v":15111.111111111111},{"$f":"+C44+D44+E44+G44","v":12231.111111111111},{"$f":"+C44+D44+E44+0.75*(F44+G44)","v":14391.111111111111}]
[null,{"$f":"SUM(B42:B44)","v":22.999966666666666},{"$f":"SUM(C42:C44)","v":8640},{"$f":"SUM(D42:D44)","v":17058.308611111112},{"$f":"SUM(E42:E44)","v":3600},null,"Column load at first floor level, P =",{"$f":"SUM(H42:H44)","v":41017.632055555558},46173.970333333331,46677.970333333331,35058.308611111112,32898.308611111112,36318.308611111112,"lbs"]
[]
[null,null,null,{"$f":"+C45+D45+E45","v":29298.308611111112},null,null,null,"LRFD Pu =",{"$f":"MAX(H45:J45)/1000","v":46.677970333333334},"kips","ASD Pa =",{"$f":"MAX(K45:M45)/1000","v":36.318308611111114},"kips"]
[null,null,null,null,null,null,null,"fc =",0.9,null,"Wc =",1.67]
[null,null,null,null,null,null,null,"req'd Pn =",{"$f":"+I47/I48","v":51.864411481481483},"kips","req'd Pn =",{"$f":"+L47*L48","v":60.651575380555556},"kips"]
["Search for the lightest Rnd HSS:"]
[]
[null,"Column Height",null,null,{"$f":"10+8/12","v":10.666666666666666},"ft","Stl Type:","A500 Gr B, Rnd HSS",null,"Fy",{"$f":"VLOOKUP(H52,StlProp,2)","v":42},"ksi"]
[null,"Effective Length Coefficient, K",null,null,1,null,null,null,null,"4.71sqrt(E/Fy)",{"$f":"4.71*SQRT(29000/K52)","v":123.76426324728337}]
[]
["Note:  It is useful to sort the section property tables by member weight when selecting lightest weight members.  This was done"]
["one a separate sheet for this problem.  Sorting the tables allows you to easily find lightest weight members that work."]
[]
[null,null,"Ag","r","Lc/r","Fe","Fn"]
["Section to Try",null,"(in2)","(in)",null,"(ksi)","(ksi)"]
["HSS3.500X0.216",null,{"$f":"VLOOKUP(A60,StlSects,5)","v":2.08},{"$f":"VLOOKUP(A60,StlSects,33)","v":1.17},{"$f":"12*E$52*E$53/D60","v":109.40170940170941},{"$f":"+(PI()^2)*29000/(E60^2)","v":23.913851469414389},{"$f":"IF(E60<=K$53,K$52*0.658^(K$52/F60),0.877*F60)","v":20.137179762270438}]
["HSS4X0.188",null,{"$f":"VLOOKUP(A61,StlSects,5)","v":2.09},{"$f":"VLOOKUP(A61,StlSects,33)","v":1.35},{"$f":"12*E$52*E$53/D61","v":94.81481481481481},{"$f":"+(PI()^2)*29000/(E61^2)","v":31.837967932652305},{"$f":"IF(E61<=K$53,K$52*0.658^(K$52/F61),0.877*F61)","v":24.180016055578445}]
["HSS5.563X0.134",null,{"$f":"VLOOKUP(A62,StlSects,5)","v":2.12},{"$f":"VLOOKUP(A62,StlSects,33)","v":1.92},{"$f":"12*E$52*E$53/D62","v":66.666666666666671},{"$f":"+(PI()^2)*29000/(E62^2)","v":64.39916871710804},{"$f":"IF(E62<=K$53,K$52*0.658^(K$52/F62),0.877*F62)","v":31.966819578972782}]
["HSS6X0.125",null,{"$f":"VLOOKUP(A63,StlSects,5)","v":2.14},{"$f":"VLOOKUP(A63,StlSects,33)","v":2.08},{"$f":"12*E$52*E$53/D63","v":61.538461538461533},{"$f":"+(PI()^2)*29000/(E63^2)","v":75.579579952717111},{"$f":"IF(E63<=K$53,K$52*0.658^(K$52/F63),0.877*F63)","v":33.284067302039297}]
[]
[null,null,null,"Check Local Buckling Criteria:  SCM Table B4.1 and SCM E7"]
[null,null,"wt/ft","Case","Coeff.","Ratio","Actual","Limit","Act/Limit"]
[{"$f":"+A60","v":"HSS3.500X0.216"},null,{"$f":"VLOOKUP(A60,StlSects,4)","v":7.5829878516758242},9,0.11,"D/t",{"$f":"VLOOKUP(A60,StlSects,29)","v":17.399999999999999},{"$f":"E67*(29000/K$52)","v":75.952380952380949},{"$f":"+G67/H67","v":0.2290909090909091},{"$f":"IF(I67<=1,\"Not Slender\",\"SLENDER!!!\")","v":"Not Slender"}]
[{"$f":"+A61","v":"HSS4X0.188"},null,{"$f":"VLOOKUP(A61,StlSects,4)","v":7.6611541675556438},9,0.11,"D/t",{"$f":"VLOOKUP(A61,StlSects,29)","v":23},{"$f":"E68*(29000/K$52)","v":75.952380952380949},{"$f":"+G68/H68","v":0.30282131661442008},{"$f":"IF(I68<=1,\"Not Slender\",\"SLENDER!!!\")","v":"Not Slender"}]
[{"$f":"+A62","v":"HSS5.563X0.134"},null,{"$f":"VLOOKUP(A62,StlSects,4)","v":7.7769284018251126},9,0.11,"D/t",{"$f":"VLOOKUP(A62,StlSects,29)","v":44.9},{"$f":"E69*(29000/K$52)","v":75.952380952380949},{"$f":"+G69/H69","v":0.59115987460815045},{"$f":"IF(I69<=1,\"Not Slender\",\"SLENDER!!!\")","v":"Not Slender"}]
[{"$f":"+A63","v":"HSS6X0.125"},null,{"$f":"VLOOKUP(A63,StlSects,4)","v":7.850572787779182},9,0.11,"D/t",{"$f":"VLOOKUP(A63,StlSects,29)","v":51.7},{"$f":"E70*(29000/K$52)","v":75.952380952380949},{"$f":"+G70/H70","v":0.68068965517241387},{"$f":"IF(I70<=1,\"Not Slender\",\"SLENDER!!!\")","v":"Not Slender"}]
[]
[null,null,null,null,"LRFD",null,"ASD"]
[null,null,"Ae","Pn","Req'd/Act",null,"Req'd/Act"]
[null,null,"(in2)","(kips)"]
[{"$f":"+A67","v":"HSS3.500X0.216"},null,{"$f":"C60","v":2.08},{"$f":"+G60*C60","v":41.885333905522515},{"$f":"+I$49/D75","v":1.2382475354850457},{"$f":"IF(E75<=1,\"OK\",IF(E75<=1.03,\"Close\",\"NG\"))","v":"NG"},{"$f":"+L$49/D75","v":1.4480384832877922},{"$f":"IF(G75<=1,\"OK\",IF(G75<=1.03,\"Close\",\"NG\"))","v":"NG"}]
[{"$f":"+A68","v":"HSS4X0.188"},null,{"$f":"C61","v":2.09},{"$f":"+G61*C61","v":50.536233556158948},{"$f":"+I$49/D76","v":1.0262816959607126},{"$f":"IF(E76<=1,\"OK\",IF(E76<=1.03,\"Close\",\"NG\"))","v":"Close"},{"$f":"+L$49/D76","v":1.2001601843389422},"NG"]
[{"$f":"+A69","v":"HSS5.563X0.134"},null,{"$f":"C62","v":2.12},{"$f":"+G62*C62","v":67.769657507422295},{"$f":"+I$49/D77","v":0.76530431743440885},"OK",{"$f":"+L$49/D77","v":0.89496653238822776},"OK"]
[{"$f":"+A70","v":"HSS6X0.125"},null,{"$f":"C63","v":2.14},{"$f":"+G63*C63","v":71.227904026364101},{"$f":"+I$49/D78","v":0.72814737693649578},"OK",{"$f":"+L$49/D78","v":0.85151425146675874},"OK"]
[]
[]
[null,"Conclusion:"]
[null,null,"For LRFD, can use the HSS4X0.188.  Given the rounding up on the trib area, this column is close enough."]
[null,null,null,"use HSS.563X0.134: slight increase in weight gets lots of reserve capacity!"]
[null,null,"For ASD, use the HSS5.563X0.134."]

{"sheet":"Example 7.3","index":2,"n_rows":311,"n_cols":29,"rows_kept":311,"cut":false,"hidden":false,"merged":[]}
["A Beginners Guide to the Steel Construction Manual, 16th Edition",null,null,null,null,null,null,"last modified:  29 May 2023"]
["Example 7.3",null,null,null,null,null,null,"by:  TBQ"]
[]
[]
[]
[]
[]
[]
[null,"Required Pn",800,"kips","(Lc)x",30,"ft"]
[null,"Fy",50,"ksi","(Lc)y",6,"ft"]
[]
[null,"Slenderness limit",200]
[]
[]
[]
[]
["Solution:"]
[]
[null,"Best Solution:",null,"W18x65"]
[]
["Computed Constants"]
[null,null,"  4.71*sqrt(E/Fy) =",{"$f":"4.71*SQRT(29000/C10)","v":113.43182093222343}]
[]
["Local Buckling Criteria:  SCM Table B4.1a"]
[null,"Case 1, lr",null,{"$f":"0.56*SQRT(29000/C10)","v":13.486585928247372},"(Unstiffened Element, flange)"]
[null,"Case 5, lr",null,{"$f":"1.49*SQRT(29000/C10)","v":35.883951844801039},"(Stiffened Element, web)"]
[]
["Table E7.1 Factors"]
[null,null,"c1","c2"]
[null,"Case (a)",0.18,1.31,"(Stiffened Element, web)"]
[null,"Case (c)",0.22,1.49,"(Unstiffened Element, flange)"]
[]
["Sections sorted by weight:  Lightest to Heaviest"]
[]
[null,"Summary","Section Properties",null,null,null,null,null,null,null,"General Slenderness Ratios",null,null,null,null,null,"Unstiffened",null,null,"Area","Stiffened",null,null,"Area","Slenderness","Compressive Strength: SCM E3, E7"]
[null,"Req'd/Act","Area","tw","tf","bf","bf/2tf","h/tw","rx","ry","(Lc/r)x","(Lc/r)y","Control","Fe","Fn","Fy/Fcr","Act/limit","Fel","be","Reduction","Act/limit","Fel","be","Reduction","Act/Limit","Ae","Pn","Req'd/Act"]
["Section",null,"(in2)","(in)","(in)","(in)",null,null,"(in)","(in)",null,null,null,"(ksi)","(ksi)",null,null,"(ksi)","(in)","(in2)",null,"(ksi)","(in)","(in2)",null,"(in2)","(kips)"]
["W6X8.5",{"$f":"AB38","v":27.757769424936072},2.52,0.17,0.19500000000000001,3.94,10.1,29.1,2.4300000000000002,0.89,{"$f":"12*F$9/I38","v":148.14814814814815},{"$f":"12*F$10/J38","v":80.898876404494388},{"$f":"MAX(K38:L38)","v":148.14814814814815},{"$f":"+(PI()^2)*29000/(M38^2)","v":13.04083166521438},{"$f":"IF(M38<=D$22,C$10*0.658^(C$10/N38),0.877*N38)","v":11.436809370393011},{"$f":"+C$10/O38","v":4.3718486844274311},{"$f":"+G38/(D$25*SQRT(P38))","v":0.35816800589536935},{"$f":"+C$10*(D$31*D$25/G38)^2","v":197.92645270071566},{"$f":"IF(G38<=D$25*SQRT(P38),1,(1-C31*SQRT(R38/O38))*SQRT(R38/O38))*(F38/2)","v":1.97},{"$f":"-4*(F38/2-S38)*E38","v":0},{"$f":"+H38/(D$26*SQRT(P38))","v":0.38784675553664294},{"$f":"+C$10*(D$30*D$26/H38)^2","v":130.47495269304801},{"$f":"IF(H38<=D$26*SQRT(P38),1,(1-C$30*SQRT(V38/O38))*SQRT(V38/O38))*(H38*D38)","v":4.947000000000001},{"$f":"-(H38*D38-W38)*D38","v":0},{"$f":"+M38/C$12","v":0.74074074074074081},{"$f":"+C38+T38+X38","v":2.52},{"$f":"+O38*Z38","v":28.820759613390386},{"$f":"C$9/AA38","v":27.757769424936072},{"$f":"IF(AB38<=1,\"Good\", IF(AB38<=1.03,\"Close\",\"No Good\"))","v":"No Good"}]
["W6X9",{"$f":"AB39","v":25.26207099532467},2.68,0.17,0.215,3.94,9.16,29.2,2.4700000000000002,0.90500000000000003,145.748987854251,79.55801104972376,145.748987854251,13.473693018731296,11.816428777427348,4.2313968917168827,0.33018061227168283,240.63325260769247,{"$f":"IF(G39<=D$25*SQRT(P39),1,(1-J33*SQRT(R39/O39))*SQRT(R39/O39))*(F39/2)","v":1.97},0,0.39558581019508204,129.58281888018394,4.9640000000000004,0,0.72874493927125494,2.68,{"$f":"+O39*Z39","v":31.668029123505292},25.26207099532467,{"$f":"IF(AB39<=1,\"Good\", IF(AB39<=1.03,\"Close\",\"No Good\"))","v":"No Good"}]
["W8X10",{"$f":"AB40","v":13.481657664461133},2.96,0.17,0.20499999999999999,3.94,9.61,40.5,3.22,0.84099999999999997,111.80124223602483,85.612366230677765,111.80124223602483,22.898365601044695,20.04725805957283,2.4941066679253097,0.451194557289677,218.62499542511765,1.97,0,0.71465633249271077,67.360155275110515,6.8850000000000007,0,0.55900621118012417,2.96,59.339883856335575,13.481657664461133,"No Good"]
["W10X12",8.4272714958328532,3.54,0.19,0.21,3.96,9.43,46.6,3.9,0.78500000000000003,92.307692307692307,91.71974522292993,92.307692307692307,33.590924423429819,26.816354578907237,1.8645338184530185,0.5120643444172629,227.05088720931937,1.98,0,0.9510438008008778,50.879319332645657,8.854000000000001,0,0.46153846153846151,3.54,94.929895209331619,8.4272714958328532,"No Good"]
["W6X12",18.765952150558608,3.55,0.23,0.28000000000000003,4,7.14,21.6,2.4900000000000002,0.91800000000000004,144.57831325301203,78.431372549019599,144.57831325301203,13.6927738670419,12.008562681395746,4.1636956334051911,0.25945180742417046,396.05013456362951,2,0,0.29499455403932534,236.81304588906031,4.9680000000000009,0,0.72289156626506013,3.55,42.630397518954901,18.765952150558608,"No Good"]
["W4X13",36.453730965542782,3.83,0.28000000000000003,0.34499999999999997,4.0599999999999996,5.88,10.6,1.72,1,209.30232558139537,72,209.30232558139537,6.533556266553239,5.7299288457671906,8.7261118498768031,0.14759271256258025,583.97188208616797,2.0299999999999998,0,9.9998897613509177E-2,983.33476940192236,2.968,0,1.0465116279069768,3.83,21.945627479288341,36.453730965542782,"No Good"]
["W8X13",10.451548122530452,3.84,0.23,0.255,4,7.84,29.9,3.21,0.84299999999999997,112.14953271028037,85.409252669039148,112.14953271028037,22.756360575375624,19.933251121355717,2.508371549407308,0.36704398025425627,328.48418367346943,2,0,0.52610810209023318,123.58641926824086,6.8769999999999998,0,0.56074766355140182,3.84,76.543684306005943,10.451548122530452,"No Good"]
["W12X14",7.7224255115186136,4.16,0.2,0.22500000000000001,3.97,8.82,54.3,4.62,0.753,77.922077922077918,95.617529880478088,95.617529880478088,31.305648366871331,25.624088382026038,1.9512889299535976,0.46817236084316188,259.54305870496353,1.9850000000000001,0,1.0832751334306461,37.472568904761431,10.274259647237461,-0.11714807055250774,0.47808764940239046,4.0428519294474921,103.59439515560703,7.7224255115186136,"No Good"]
["W10X15",6.6595537978682602,4.41,0.23,0.27,4,7.41,38.5,3.95,0.81,91.139240506329116,88.888888888888886,91.139240506329116,34.457751368610367,27.239947479616195,1.8355395155374392,0.40554057721670111,367.71400649448805,2,0,0.79191504721463635,74.540391087873175,8.8550000000000004,0,0.45569620253164556,4.41,120.12816838510743,6.6595537978682602,"No Good"]
["W6X15",14.227021736052315,4.43,0.23,0.26,5.99,11.5,21.2,2.56,1.45,140.625,49.655172413793103,140.625,14.473470236777755,12.693233397654092,3.9391066431694846,0.42963232259950596,152.66901655954632,2.9950000000000001,0,0.29767113708207382,245.83369235048059,4.8760000000000003,0,0.703125,4.43,56.231023951607625,14.227021736052315,"No Good"]
["W8X15",8.6485184421748098,4.4400000000000004,0.245,0.315,4.01,6.37,28.1,3.29,0.876,109.42249240121581,82.191780821917803,109.42249240121581,23.904768247971511,20.833646986462451,2.39996386770351,0.304884297138515,497.58550899649805,2.0049999999999999,0,0.50547968136837662,139.92666593634831,6.8845000000000001,0,0.54711246200607899,4.4400000000000004,92.501392619893295,8.6485184421748098,"No Good"]
["W12X16",6.4080886215932003,4.71,0.22,0.26500000000000001,3.99,7.53,49.4,4.67,0.77300000000000002,77.087794432548179,93.143596377749034,93.143596377749034,32.990715778776455,26.51411798227268,1.8857877917504162,0.40658049706802962,356.08742436187089,1.9950000000000001,0,1.0024905185423829,45.275080188988511,10.861266507479222,-1.4813683545712663E-3,0.46571798188874519,4.7085186316454291,124.84221852117602,6.4080886215932003,"No Good"]
["W5X16",19.3293628128941,4.71,0.24,0.36,5,6.94,15.4,2.13,1.26,169.01408450704227,57.142857142857146,169.01408450704227,10.019636095769803,8.7872208559901175,5.690081178045701,0.21572387632915813,419.20615236402591,2.5,0,0.17991245280376961,465.87744429920724,3.6959999999999997,0,0.84507042253521136,4.71,41.387810231713452,19.3293628128941,"No Good"]
["W6X16",12.890584623711346,4.74,0.26,0.40500000000000003,4.03,4.9800000000000004,19.100000000000001,2.6,0.96699999999999997,138.46153846153845,74.457083764219234,138.46153846153845,14.92929974374659,13.092995875265759,3.8188356947744864,0.18895649840415774,814.11902388671149,2.0150000000000001,0,0.2723752334075728,302.86311967873689,4.9660000000000002,0,0.69230769230769229,4.74,62.0608004487597,12.890584623711346,"No Good"]
["W10X17",5.7137155094613092,4.99,0.24,0.33,4.01,6.08,36.9,4.05,0.84499999999999997,88.888888888888886,85.207100591715985,88.888888888888886,36.224532403373281,28.058912106682786,1.7819650245132457,0.33771625732735272,546.18457409972302,2.0049999999999999,0,0.77032947074933966,81.144743862045672,8.8559999999999999,0,0.44444444444444442,4.99,140.0139714123471,5.7137155094613092,"No Good"]
["W8X18",6.8066784327135901,5.26,0.23,0.33,5.25,7.95,29.9,3.43,1.23,104.95626822157433,58.536585365853661,104.95626822157433,25.982502744852699,22.344416040265049,2.237695534754593,0.39406204540200662,319.45694300067242,2.625,0,0.5570195338492423,123.58641926824086,6.8769999999999998,0,0.52478134110787167,5.26,117.53162837179416,6.8066784327135901,"No Good"]
["W5X19",15.776235936313181,5.56,0.27,0.43,5.03,5.85,13.7,2.17,1.28,165.89861751152074,56.25,165.89861751152074,10.399494018243832,9.1203562539998408,5.4822419878688295,0.18525704888720884,589.97669486448979,2.5150000000000001,0,0.1630576583562974,588.67011929245052,3.6989999999999998,0,0.82949308755760365,5.56,50.709180772239108,15.776235936313181,"No Good"]
["W12X19",5.0337531079160911,5.57,0.23499999999999999,0.35,4.01,5.72,46.2,4.82,0.82199999999999995,74.688796680497916,87.591240875912419,87.591240875912419,37.305802396648176,28.532700717830583,1.7523753006932894,0.32039109989642756,617.09855738666943,2.0049999999999999,0,0.97258630221527842,51.764160477689693,10.856999999999999,0,0.43795620437956212,5.57,158.92714299831636,5.0337531079160911,"No Good"]
["W10X19",4.9487185567480108,5.62,0.25,0.39500000000000002,4.0199999999999996,5.09,35.4,4.1399999999999997,0.874,86.956521739130437,82.379862700228827,86.956521739130437,37.852400279277958,28.764770680743922,1.7382373930577391,0.28626036086461965,779.31139064616877,2.0099999999999998,0,0.74825297580203587,88.167109299690381,8.85,0,0.43478260869565216,5.62,161.65801122578085,4.9487185567480108,"No Good"]
["W6X20",9.9448051274227751,5.87,0.26,0.36499999999999999,6.02,8.25,18.7,2.66,1.5,135.33834586466165,48,135.33834586466165,15.626294861960556,13.704260593939408,3.6485003811232306,0.32025412090510047,296.6461331864096,3.01,0,0.27282498711557557,315.95840513025831,4.8620000000000001,0,0.67669172932330823,5.87,80.444009686424323,9.9448051274227751,"No Good"]
["W8X21",5.6547852038829154,6.16,0.25,0.4,5.27,6.59,27.5,3.49,1.26,103.15186246418338,57.142857142857146,103.15186246418338,26.899462101894645,22.966412549313674,2.1770923034949226,0.33116541064609595,464.91735627393325,2.6349999999999998,0,0.51939050666047581,146.09916653223144,6.875,0,0.51575931232091687,6.16,141.47310130377224,5.6547852038829154,"No Good"]
["W12X22",4.1827482366673134,6.48,0.26,0.42499999999999999,4.03,4.74,41.8,4.91,0.84799999999999998,73.319755600814659,84.905660377358487,84.905660377358487,39.70310341319211,29.515711474383028,1.6940130358502619,0.27003368552448631,898.64860688280044,2.0150000000000001,0,0.89498888663624965,63.235442578008758,10.868,0,0.42452830188679241,6.48,191.26181035400202,4.1827482366673134,"No Good"]
["W10X22",4.1455934047623622,6.49,0.24,0.36,5.75,7.99,36.9,4.2699999999999996,1.33,84.309133489461374,54.13533834586466,84.309133489461374,40.266927410910803,29.734359332713201,1.6815563248067333,0.45686621782252479,316.26638178824913,2.875,0,0.79299489505209131,81.144743862045672,8.8559999999999999,0,0.42154566744730687,6.49,192.97599206930869,4.1455934047623622,"No Good"]
["W14X22",3.7403941449328295,6.49,0.23,0.33500000000000002,5,7.46,53.3,5.54,1.04,64.981949458483754,69.230769230769226,69.230769230769226,59.71719897498636,35.218773728697009,1.4196973575845695,0.46423610809737259,362.80138288926105,2.5,0,1.246605552161,38.89185948417574,10.445659039925317,-0.4170684208171771,0.34615384615384615,6.0729315791828231,213.88120315709844,3.7403941449328295,"No Good"]
["W8X24",5.0808494987804709,7.08,0.245,0.4,6.5,8.1199999999999992,25.9,3.42,1.61,105.26315789473685,44.720496894409933,105.26315789473685,25.831222118751114,22.239263396722794,2.2482759032103581,0.40154035865182997,306.22068965517258,3.25,0,0.48136520662265203,164.70758439796666,6.3454999999999995,0,0.52631578947368429,7.08,157.45398484879738,5.0808494987804709,"No Good"]
["W6X25",7.7192314646021094,7.34,0.32,0.45500000000000002,6.08,6.68,15.5,2.7,1.52,133.33333333333331,47.368421052631575,133.33333333333331,16.099792179277017,14.119517741225945,3.5411974343862176,0.26320817154907233,452.47403635842102,3.04,0,0.22953893512096091,459.88551379812702,4.96,0,0.66666666666666652,7.34,103.63726022059844,7.7192314646021094,"No Good"]
["W10X26",3.4691338456054974,7.61,0.26,0.44,5.77,6.56,34,4.3499999999999996,1.36,82.758620689655174,52.941176470588232,82.758620689655174,41.789892662876447,30.302905688003463,1.6500067853161147,0.37866830050304678,469.17937239738256,2.8849999999999998,0,0.73762527025474833,95.577417551903125,8.84,0,0.41379310344827586,7.61,230.60511228570635,3.4691338456054974,"No Good"]
["W12X26",3.0464883226339605,7.65,0.23,0.38,6.49,8.5399999999999991,47.2,5.17,1.51,69.632495164410059,47.682119205298015,69.632495164410059,59.030142000092916,35.075414376891679,1.4254999089316791,0.53036181716290653,276.84127922601454,3.2450000000000001,0,1.1016867761069071,49.593998981075842,10.145792230978058,-0.163347786875047,0.34816247582205029,7.4866522131249535,262.59742867103091,3.0464883226339605,"No Good"]
["W16X26",3.1120530684331622,7.68,0.25,0.34499999999999997,5.5,7.97,56.8,6.26,1.1200000000000001,57.507987220447284,64.285714285714278,64.285714285714278,69.257816562706083,36.96068186974118,1.3527888954054659,0.50809074335754445,317.85565758671567,2.75,0,1.3609214390134796,34.246520621528475,11.300376903000512,-0.7249057742498719,0.3214285714285714,6.9550942257501278,257.06502505202434,3.1120530684331622,"No Good"]
["W14X26",2.9867084098375463,7.69,0.255,0.42,5.03,5.98,48.1,5.65,1.08,63.716814159292028,66.666666666666657,66.666666666666657,64.399168717108068,36.127608834197225,1.3839830980640937,0.37690662135616249,564.60435118175405,2.5150000000000001,0,1.1394084030492686,47.755453464499205,11.183506059176141,-0.27590845491008442,0.33333333333333326,7.4140915450899163,267.85339920193741,2.9867084098375463,"No Good"]
["W8X28",4.3047690643019365,8.24,0.28499999999999998,0.46500000000000002,6.54,7.03,22.3,3.45,1.62,104.34782608695652,44.444444444444443,104.34782608695652,26.286389082831917,22.553446466127781,2.2169560681154974,0.3500860113567385,408.54127383354006,3.27,0,0.41737463696554084,222.1792006475095,6.3554999999999993,0,0.52173913043478259,8.24,185.84039888089291,4.3047690643019365,"No Good"]
["W12X30",2.5807337265282175,8.7899999999999991,0.26,0.44,6.52,7.41,41.8,5.21,1.52,69.097888675623807,47.368421052631575,69.097888675623807,59.947101357134855,35.266138960853482,1.4177905910114392,0.46143458183696551,367.71400649448805,3.26,0,0.97829531031344275,63.235442578008758,10.868,0,0.34548944337811904,8.7899999999999991,309.98936146590205,2.5807337265282175,"No Good"]
["W10X30",2.9660904745534857,8.84,0.3,0.51,5.81,5.7,29.5,4.38,1.37,82.191780821917817,52.554744525547441,82.191780821917817,42.368292604131945,30.510781222944516,1.638764987190801,0.33015242657410321,621.43667097568493,2.9049999999999998,0,0.64218981361170213,126.96063739155414,8.85,0,0.41095890410958907,8.84,269.71530601082952,2.9660904745534857,"No Good"]
["W14X30",2.4694830953452325,8.85,0.27,0.38500000000000001,6.73,8.74,45.4,5.73,1.49,62.827225130890049,48.322147651006709,62.827225130890049,72.510681295333924,37.465110531498652,1.3345750030007968,0.56096777760804073,264.31616440364672,3.3650000000000002,0,1.0951764454031321,53.604521090065795,11.505517820649773,-0.20317018842456147,0.31413612565445026,8.6468298115754383,323.95443463773148,2.4694830953452325,"No Good"]
["W8X31",3.8539674737456338,9.1199999999999992,0.28499999999999998,0.435,8,9.19,22.3,3.47,2.02,103.74639769452449,35.643564356435647,103.74639769452449,26.592042201845903,22.760778040599419,2.1967614600350109,0.45975031688333368,239.06476192957052,4,0,0.41928868972249322,222.1792006475095,6.3554999999999993,0,0.51873198847262247,9.1199999999999992,207.57829573026669,3.8539674737456338,"No Good"]
["W16X31",2.4707587491855327,9.1300000000000008,0.27500000000000002,0.44,5.53,6.28,51.6,6.41,1.17,56.162246489859591,61.53846153846154,61.53846153846154,75.579579952717097,37.906750194545133,1.3190262880196761,0.40544401546169806,511.94970992738052,2.7650000000000001,0,1.2520529935003235,41.496715450543839,12.050639850773457,-0.58832404103729963,0.30769230769230771,8.5416759589627009,323.78717681915083,2.4707587491855327,"No Good"]
["W10X33",2.8269199161243797,9.7100000000000009,0.28999999999999998,0.435,7.96,9.15,27.1,4.1900000000000004,1.94,85.918854415274453,37.113402061855673,85.918854415274453,38.77223065550141,29.14454312003722,1.7155870240979831,0.51797964528718587,241.15951434799484,3.98,0,0.57658408309519449,150.44388650753666,7.859,0,0.42959427207637224,9.7100000000000009,282.99351369556143,2.8269199161243797,"No Good"]
["W14X34",2.1362646820246192,10,0.28499999999999998,0.45500000000000002,6.75,7.41,43.1,5.83,1.53,61.749571183533448,47.058823529411761,61.749571183533448,75.06367989056632,37.834680555943699,1.3215388438675524,0.47794312381281623,367.71400649448805,3.375,0,1.0448093213729075,59.478305290130862,11.925397783777242,-0.10205913162348591,0.30874785591766724,9.897940868376514,374.48543091664538,2.1362646820246192,"No Good"]
["W12X35",2.190752769725048,10.3,0.3,0.52,6.56,6.31,36.200000000000003,5.25,1.54,68.571428571428569,46.753246753246749,68.571428571428569,60.871127838315878,35.453522636590968,1.4102970955104999,0.39397805307956202,507.09329743495732,3.28,0,0.84947968942755003,84.313280035713177,10.860000000000001,0,0.34285714285714286,10.3,365.171283156887,2.190752769725048,"No Good"]
["W18X35",2.1894918145152462,10.3,0.3,0.42499999999999999,6,7.06,53.5,7.04,1.22,51.136363636363633,59.016393442622949,59.016393442622949,82.17740287940984,38.758896971582743,1.2900263915317045,0.46089646762317543,405.07662849392921,3,0,1.3126659476767057,38.601622740850736,13.140126253150761,-0.8729621240547718,0.29508196721311475,9.4270378759452296,365.38158978096936,2.1894918145152462,"No Good"]
["W8X35",3.3521243594588093,10.3,0.31,0.495,8.02,8.1,20.5,3.51,2.0299999999999998,102.56410256410257,35.467980295566505,102.56410256410257,27.208648782978148,23.170352464238807,2.1579300564016086,0.40885029275016449,307.73475750647771,4.01,0,0.38889728732884987,262.90897011302803,6.3549999999999995,0,0.51282051282051289,10.3,238.65463038165973,3.3521243594588093,"No Good"]
["W16X36",1.983271411974602,10.6,0.29499999999999998,0.43,6.99,8.1199999999999992,48.1,6.51,1.52,55.299539170506911,47.368421052631575,55.299539170506911,93.595446164194499,39.98192750406043,1.250565020781506,0.53839481275773637,306.22068965517258,3.4950000000000001,0,1.1986480209973212,47.755453464499205,12.456980503605896,-0.51109325143626028,0.27649769585253453,10.088906748563739,403.37393821630144,1.983271411974602,"No Good"]
["W14X38",1.8807772493130048,11.2,0.31,0.51500000000000001,6.77,6.57,39.6,5.87,1.55,61.32879045996593,46.451612903225808,61.32879045996593,76.09724679590262,37.978219618863577,1.3165440745191033,0.42456642256586641,467.75221163491636,3.3849999999999998,0,0.96178327222790738,70.456773983522098,12.276,0,0.30664395229982966,11.2,425.35605973127201,1.8807772493130048,"No Good"]
["W10X39",2.3395566258180636,11.5,0.315,0.53,7.99,7.53,25,4.2699999999999996,1.98,84.309133489461374,36.363636363636367,84.309133489461374,40.266927410910803,29.734359332713201,1.6815563248067333,0.43056353194037689,356.08742436187089,3.9950000000000001,0,0.53725941399193178,176.77999150400001,7.875,0,0.42154566744730687,11.5,341.94513232620181,2.3395566258180636,"No Good"]
["W12X40",1.960251177837359,11.7,0.29499999999999998,0.51500000000000001,8.01,7.77,33.6,5.13,1.94,70.175438596491233,37.113402061855673,70.175438596491233,58.12024976719001,34.881279067259158,1.4334336737935687,0.48120506921229977,334.42947812677545,4.0049999999999999,0,0.7820782550593518,97.8666159031321,9.911999999999999,0,0.35087719298245618,11.7,408.11096508693214,1.960251177837359,"No Good"]
["W8X40",2.9254796521842255,11.7,0.36,0.56000000000000005,8.07,7.21,17.600000000000001,3.53,2.04,101.98300283286119,35.294117647058826,101.98300283286119,27.519602245096429,23.372600908373215,2.1392569956597147,0.36551210166540848,388.39717221227261,4.0350000000000001,0,0.33533657336606193,356.68741829158051,6.3360000000000003,0,0.50991501416430596,11.7,273.45943062796658,2.9254796521842255,"No Good"]
["W16X40",1.747629050417751,11.8,0.30499999999999999,0.505,7,6.93,46.5,6.63,1.57,54.298642533936651,45.859872611464965,54.298642533936651,97.077771583712192,40.303900250651104,1.2405747257473489,0.46133855002075641,420.41685542291611,3.5,0,1.1634325849618425,51.098390422014106,12.732615875164949,-0.44221465807469018,0.27149321266968324,11.357785341925311,457.76304748926498,1.747629050417751,"No Good"]
["W18X40",1.8374400328760638,11.8,0.315,0.52500000000000002,6.02,5.73,50.9,7.21,1.27,49.930651872399444,56.69291338582677,56.69291338582677,89.051285342784283,39.528335930107488,1.264915378385979,0.37776512516572902,614.94651523319601,3.01,0,1.2612081857788329,42.645927215812826,13.540130501891076,-0.7854113919043112,0.28346456692913385,11.014588608095689,435.38835863274147,1.8374400328760638,"No Good"]
["W14X43",1.6797544878203712,12.6,0.30499999999999999,0.53,8,7.54,37.4,5.82,1.89,61.855670103092784,38.095238095238095,61.855670103092784,74.806392402378975,37.798418728709585,1.3228066591585423,0.48609497973464144,355.14352173025918,4,0,0.90619810723678018,78.989601282564578,11.407,0,0.30927835051546393,12.6,476.26007598174078,1.6797544878203712,"No Good"]
["W21X44",1.726193749981342,13,0.35,0.45,6.5,7.22,53.6,8.06,1.26,44.665012406947888,57.142857142857146,57.142857142857146,87.654424087174846,39.38057741791966,1.2696614239396118,0.47510676184922018,387.32202484634104,3.25,0,1.3256246224754313,38.457721196953663,15.241216107906052,-1.2315743622328812,0.28571428571428575,11.76842563776712,463.44739691511859,1.726193749981342,"No Good"]
["W12X45",1.7458786924296033,13.1,0.33500000000000002,0.57499999999999996,8.0500000000000007,7,29.6,5.15,1.95,69.902912621359221,36.923076923076927,69.902912621359221,58.57431249312409,34.978777480290908,1.4294381794267375,0.43412353165236961,412.05056000000002,4.0250000000000004,0,0.68993592144483995,126.1042443046932,9.9160000000000004,0,0.34951456310679613,13.1,458.22198499181087,1.7458786924296033,"No Good"]
["W10X45",1.9988729703833876,13.3,0.35,0.62,8.02,6.47,22.5,4.32,2.0099999999999998,83.333333333333329,35.820895522388064,83.333333333333329,41.215467978949164,30.092145339437288,1.661563156631191,0.37217211463585381,482.32306137708463,4.01,0,0.48643389151911859,218.24690309135804,7.8749999999999991,0,0.41666666666666663,13.3,400.22553301451592,1.9988729703833876,"No Good"]
["W16X45",1.5007818575777221,13.3,0.34499999999999997,0.56499999999999995,7.04,6.23,41.1,6.65,1.57,54.13533834586466,45.859872611464965,54.13533834586466,97.664342887253468,40.356117134135843,1.2389695429272785,0.41500727287684186,520.20017674536052,3.52,0,1.0289902067861068,65.407791032494487,13.915123756771218,-9.1209803913929619E-2,0.27067669172932329,13.208790196086071,533.05548435347464,1.5007818575777221,"No Good"]
["W18X46",1.5343328918796737,13.5,0.36,0.60499999999999998,6.06,5.01,44.6,7.25,1.29,49.655172413793103,55.813953488372093,55.813953488372093,91.878134998404946,39.815181151504277,1.2558023988322586,0.33149352354327216,804.39828685941507,3.03,0,1.1091082591885713,55.544800161877376,14.932356293662391,-0.40451173428153964,0.27906976744186046,13.09548826571846,521.39923756697908,1.5343328918796737,"No Good"]
["W14X48",1.4967674190294196,14.1,0.34,0.59499999999999997,8.0299999999999994,6.75,33.6,5.85,1.91,61.53846153846154,37.696335078534034,61.53846153846154,75.579579952717097,37.906750194545133,1.3190262880196761,0.43578775547236648,443.13805080932792,4.0149999999999997,0,0.815290321349048,97.8666159031321,11.424000000000001,0,0.30769230769230771,14.1,534.48517774308641,1.4967674190294196,"No Good"]
["W21X48",1.4527096711137741,14.1,0.35,0.43,8.14,9.4700000000000006,53.6,8.24,1.66,43.689320388349515,43.373493975903614,43.689320388349515,149.95023998239768,43.486907906741123,1.1497713313447437,0.65485058133691354,225.13687351487332,4.07,0,1.393024602553369,38.457721196953663,14.655620630911168,-1.4365327791810905,0.21844660194174759,12.663467220818909,550.69503281178686,1.4527096711137741,"No Good"]
["W8X48",2.3479472077365928,14.1,0.4,0.68500000000000005,8.11,5.92,15.9,3.61,2.08,99.7229916897507,34.615384615384613,99.7229916897507,28.781083903917139,24.16476335819193,2.0691284768178724,0.30515883907412239,576.10703067932809,4.0549999999999997,0,0.30803717385225676,437.03767528974328,6.36,0,0.49861495844875348,14.1,340.72316335050618,2.3479472077365928,"No Good"]
["W10X49",1.8333408725734608,14.4,0.34,0.56000000000000005,10,8.93,23.1,4.3499999999999996,2.54,82.758620689655174,28.346456692913385,82.758620689655174,41.789892662876447,30.302905688003463,1.6500067853161147,0.51547376882503171,253.18832226261497,5,0,0.50115128655543195,207.05664191075877,7.854000000000001,0,0.41379310344827586,14.4,436.36184190724987,1.8333408725734608,"No Good"]
["W12X50",1.5600568568013473,14.6,0.37,0.64,8.08,6.31,26.8,5.18,1.96,69.498069498069498,36.734693877551024,69.498069498069498,59.258719296465372,35.123412527600316,1.4235518818312292,0.39213958561059997,507.09329743495732,4.04,0,0.62596186949913157,153.83088478781465,9.9160000000000004,0,0.34749034749034746,14.6,512.80182290296455,1.5600568568013473,"No Good"]
["W16X50",1.3459510988533772,14.7,0.38,0.63,7.07,5.61,37.4,6.68,1.59,53.892215568862277,45.283018867924525,53.892215568862277,98.547512557005575,40.433689421439745,1.2365925720715403,0.37406538423966301,641.5357551609203,3.5350000000000001,0,0.93725554887790297,78.989601282564578,14.212,0,0.26946107784431139,14.7,594.37523449516425,1.3459510988533772,"No Good"]
["W18X50",1.3459558467475179,14.7,0.35499999999999998,0.56999999999999995,7.5,6.57,45.2,7.38,1.65,48.780487804878049,43.63636363636364,48.780487804878049,120.28333623717627,42.015467730357095,1.1900379241493939,0.44656321405972954,467.75221163491636,3.75,0,1.1546696979640909,54.079946887970863,14.486933808608628,-0.55346849794393693,0.24390243902439024,14.146531502056062,594.37313782111653,1.3459558467475179,"No Good"]
["W21X50",1.4609721518051233,14.7,0.38,0.53500000000000003,6.53,6.1,49.4,8.18,1.3,44.009779951100249,55.38461538461538,55.38461538461538,93.308123398416186,39.954408811109651,1.2514263503780612,0.40431994317871006,542.60890728298864,3.2650000000000001,0,1.2306201901304692,45.275080188988511,16.153936073595926,-0.99486429203354765,0.27692307692307688,13.705135707966452,547.58059488782828,1.4609721518051233,"No Good"]
["W12X53",1.4502742439635066,15.6,0.34499999999999997,0.57499999999999996,10,8.69,28.1,5.23,2.48,68.833652007648183,29.032258064516128,68.833652007648183,60.40823120720799,35.360244102453834,1.4140173878644191,0.54186409869064744,267.36652766761006,5,0,0.65853472378156097,139.92666593634831,9.6944999999999997,0,0.34416826003824091,15.6,551.61980799827984,1.4502742439635066,"No Good"]
["W14X53",1.3477863630230398,15.6,0.37,0.66,8.06,6.11,30.9,5.89,1.92,61.120543293718171,37.5,61.120543293718171,76.616680420122904,38.049094937440493,1.314091703947464,0.39520856644956504,540.83422684499396,4.03,0,0.75118235413869594,115.71673389470159,11.433,0,0.30560271646859083,15.6,593.5658810240717,1.3477863630230398,"No Good"]
["W10X54",1.6632688927577752,15.8,0.37,0.61499999999999999,10,8.15,21.2,4.37,2.56,{"$f":"12*F$9/I102","v":82.379862700228827},{"$f":"12*F$10/J102","v":28.125},{"$f":"MAX(K102:L102)","v":82.379862700228827},{"$f":"+(PI()^2)*29000/(M102^2)","v":42.175050928454773},{"$f":"IF(M102<=D$22,C$10*0.658^(C$10/N102),0.877*N102)","v":30.441807462925251},{"$f":"+C$10/O102","v":1.6424780315983032},{"$f":"+G102/(D$25*SQRT(P102))","v":0.47152616873552272},{"$f":"+C$10*(D$31*D$25/G102)^2","v":303.97045338552448},5,{"$f":"-4*(F102/2-S102)*E102","v":0},{"$f":"+H102/(D$26*SQRT(P102))","v":0.46098395645638618},{"$f":"+C$10*(D$30*D$26/H102)^2","v":245.83369235048059},{"$f":"IF(H102<=D$26*SQRT(P102),1,(1-C$30*SQRT(V102/O102))*SQRT(V102/O102))*(H102*D102)","v":7.8439999999999994},{"$f":"-(H102*D102-W102)*D102","v":0},{"$f":"+M102/C$12","v":0.41189931350114412},{"$f":"+C102+T102+X102","v":15.8},480.98055791421899,{"$f":"C$9/AA102","v":1.6632688927577752},"No Good"]
["W18X55",1.1888331674469899,16.2,0.39,0.63,7.53,5.98,41.1,7.41,1.67,48.582995951417004,43.113772455089823,48.582995951417004,121.26323716858165,42.074580293645738,1.1883659837137148,0.40674671511243937,564.60435118175405,{"$f":"IF(G103<=D$25*SQRT(P103),1,(1-J97*SQRT(R103/O103))*SQRT(R103/O103))*(F103/2)","v":3.7650000000000001},0,1.0506702874265343,65.407791032494487,15.500057366213163,-0.20628762717686644,0.24291497975708501,15.993712372823133,{"$f":"+O103*Z103","v":672.92873542382222},1.1888331674469899,{"$f":"IF(AB103<=1,\"Good\", IF(AB103<=1.03,\"Close\",\"No Good\"))","v":"No Good"}]
["W21X55",{"$f":"AB104","v":1.2233335193889106},16.2,0.375,0.52200000000000002,8.2200000000000006,7.87,50,8.4,1.73,42.857142857142854,41.618497109826592,42.857142857142854,155.83008726608864,43.716516331028231,1.1437324882292144,0.54564537673193347,325.98463016392498,4.1100000000000003,0,1.3028892786722275,44.194997876000002,15.44039134273844,-1.2411032464730849,0.21428571428571427,14.958896753526915,653.95085421972453,1.2233335193889106,"No Good"]
["W24X55",1.3695766002819914,16.2,0.39500000000000002,0.505,7.01,6.94,54.6,9.11,1.34,39.517014270032931,53.731343283582085,53.731343283582085,99.138500813133788,40.484907919698749,1.2350281270041248,0.46304054693348412,419.20615236402591,3.5049999999999999,0,1.3691592134922743,37.061913714795587,17.08129160984771,-1.7718548141101547,0.26865671641791045,14.428145185889845,584.1221293027952,1.3695766002819914,"No Good"]
["W21X57",1.2368890414695115,16.7,0.40500000000000003,0.65,6.56,5.04,46.3,8.36,1.35,43.062200956937801,53.333333333333329,53.333333333333329,100.62370112048136,40.611244760112633,1.2311860987109848,0.33679579536901233,794.85061728395067,3.28,0,1.1628370861733983,51.540798664918917,16.840953237708,-0.77377143872826015,0.26666666666666666,15.926228561271738,646.78396620730302,1.2368890414695115,"No Good"]
["W16X57",1.1747424592738411,16.8,0.43,0.71499999999999997,7.12,4.9800000000000004,33,6.72,1.6,53.571428571428577,45,53.571428571428577,99.731255850296705,40.535733805418936,1.2334795822375333,0.33247679275321762,814.11902388671149,3.56,0,0.82803308941530707,101.45775453627182,14.19,0,0.2678571428571429,16.8,681.0003279310381,1.1747424592738411,"No Good"]
["W12X58",1.3221775582664184,17,0.36,0.64,10,7.82,27,5.28,2.5099999999999998,68.181818181818173,28.685258964143429,68.181818181818173,61.568785499417885,35.591909146539471,1.4048136556580697,0.48921004872452434,330.16655830351721,5,0,0.63482517179447029,151.56034936899863,9.7199999999999989,0,0.34090909090909088,17,605.06245549117102,1.3221775582664184,"No Good"]
["W8X58",1.9055830733017416,17.100000000000001,0.51,0.81,8.2200000000000006,5.07,12.4,3.65,2.1,98.630136986301366,34.285714285714285,98.630136986301366,29.422425419536079,24.550819319534405,2.0365919095912366,0.2634231437723531,785.47193103260474,4.1100000000000003,0,0.24214160284278097,718.57111530957343,6.3240000000000007,0,0.49315068493150682,17.100000000000001,419.81901036403838,1.9055830733017416,"No Good"]
["W10X60",1.4864414508070165,17.600000000000001,0.42,0.68,10.1,7.41,18.7,4.3899999999999997,2.57,82.004555808656036,28.015564202334634,82.004555808656036,42.561975975067838,30.579438853691375,1.635085595887718,0.42968078999909204,367.71400649448805,5.05,0,0.40754080128164299,315.95840513025831,7.8539999999999992,0,0.41002277904328016,17.600000000000001,538.19812382496821,1.4864414508070165,"No Good"]
["W18X60",1.0773537872264223,17.600000000000001,0.41499999999999998,0.69499999999999995,7.56,5.44,38.700000000000003,7.47,1.68,48.192771084337352,42.857142857142861,48.192771084337352,123.23496480337704,42.190918149148793,1.1850891659490648,0.3705282813277041,682.25823961937704,3.78,0,0.99068408420524123,73.771938578744596,16.060500000000001,0,0.24096385542168675,17.600000000000001,742.56015942501881,1.0773537872264223,"No Good"]
["W14X61",1.165061423130584,17.899999999999999,0.375,0.64500000000000002,10,7.75,30.4,5.98,2.4500000000000002,60.200668896321069,29.387755102040813,60.200668896321069,78.975995644419456,38.36084222072666,1.303412467127341,0.50333686911808773,336.15779296566075,5,0,0.74204865640756223,119.5545086240478,11.399999999999999,0,0.30100334448160537,17.899999999999999,686.65907575100721,1.165061423130584,"No Good"]
["W24X62",1.1658281177082515,18.2,0.43,0.59,7.04,5.97,50.1,9.23,1.38,39.003250270855901,52.173913043478265,52.173913043478265,105.14555633132765,40.976110526368245,1.2202231826718852,0.40073075206480768,566.49740719229885,3.52,0,1.2639148741391799,44.018746813757716,18.162827982814385,-1.4534739673898143,0.26086956521739135,16.746526032610184,686.20750164493802,1.1658281177082515,"No Good"]
["W21X62",1.0545863052967779,18.3,0.4,0.61499999999999999,8.24,6.7,46.9,8.5399999999999991,1.77,42.154566744730687,40.677966101694913,42.154566744730687,161.06770964364321,43.907847749408653,1.1387485965005741,0.46554198235633693,449.77673067498341,4.12,0,1.224781591165665,50.230492991939492,16.202239109538279,-1.0231043561846889,0.21077283372365344,17.276895643815312,758.59130351106432,1.0545863052967779,"No Good"]
["W12X65",1.1768072508130425,19.100000000000001,0.39,0.60499999999999998,12,9.92,24.9,5.28,3.02,68.181818181818173,23.841059602649008,68.181818181818173,61.568785499417885,35.591909146539471,1.4048136556580697,0.62058359122088003,205.17443418314261,6,0,0.58544988065490033,178.20276235867166,9.7110000000000003,0,0.34090909090909088,19.100000000000001,679.80546469890396,1.1768072508130425,"No Good"]
["W18X65",0.99184613457010717,19.100000000000001,0.45,0.75,7.59,5.0599999999999996,35.700000000000003,7.49,1.69,48.064085447263018,42.603550295857993,48.064085447263018,123.89574091037839,42.229147540188485,1.1840163231430656,0.34480189832648289,788.57963098939251,3.7949999999999999,0,0.91430081324018464,86.691535194469949,16.065000000000001,0,0.24032042723631508,19.100000000000001,806.57671801760011,0.99184613457010717,"Good"]
["W16X67",0.98766376271584122,19.7,0.39500000000000002,0.66500000000000004,10.199999999999999,7.7,35.9,6.96,2.46,51.724137931034484,29.26829268292683,51.724137931034484,106.98212521696369,41.116358206938834,1.2160610078438794,0.51773916590670588,340.53765289256199,5.0999999999999996,0,0.90722811743993848,85.72830338839708,14.1805,0,0.25862068965517243,19.7,809.99225667669498,0.98766376271584122,"Good"]
["W8X67",1.610800403579334,19.7,0.56999999999999995,0.93500000000000005,8.2799999999999994,4.43,11.1,3.72,2.12,96.774193548387089,33.962264150943398,96.774193548387089,30.561778339328818,25.210533201755258,1.9832979969070548,0.23324251507437932,1028.8193794618064,4.1399999999999997,0,0.21964874539099519,896.74129283337402,6.3269999999999991,0,0.48387096774193544,19.7,496.64750407457853,1.610800403579334,"No Good"]
["W10X68",1.2937432278394947,20,0.47,0.77,10.1,6.58,16.7,4.4400000000000004,2.59,81.081081081081081,27.799227799227801,81.081081081081081,43.537018258627619,30.918036237220409,1.6171790347993684,0.38365849478505298,466.33155273879589,5.05,0,0.36596297946082451,396.16872132381957,7.8489999999999993,0,0.40540540540540543,20,618.36072474440823,1.2937432278394947,"No Good"]
["W14X68",1.039981996907638,20,0.41499999999999998,0.72,10,6.97,27.5,6.01,2.46,59.900166389351085,29.26829268292683,59.900166389351085,79.770384567174716,38.462204267899878,1.2999774961345478,0.45327611736932721,415.60525721013823,5,0,0.67214738211584069,146.09916653223144,11.4125,0,0.29950083194675542,20,769.24408535799762,1.039981996907638,"No Good"]
["W21X68",0.94293322609773023,20,0.43,0.68500000000000005,8.27,6.04,43.6,8.6,1.8,41.860465116279073,40,41.860465116279073,163.33890666383098,43.987245630371547,1.1366931319172409,0.42006190430871077,553.44276128239994,4.1349999999999998,0,1.1396319231523049,58.121946116698922,17.091678095928785,-0.71221841875062297,0.20930232558139536,19.287781581249376,848.41638607937239,0.94293322609773023,"Good"]
["W24X68",0.97853452980319611,20.100000000000001,0.41499999999999998,0.58499999999999996,8.9700000000000006,7.66,52,9.5500000000000007,1.87,37.696335078534027,38.502673796791441,38.502673796791441,193.07051876445061,44.863739178591096,1.1144857944399766,0.53800892131825362,344.1034678810272,4.4850000000000003,0,1.3726689495494371,40.860759870562134,17.056955695956297,-1.8770633861781358,0.19251336898395721,18.222936613821865,817.54907531050219,0.97853452980319611,"Good"]
["W18X71",0.91037190674173629,20.8,0.495,0.81,7.64,4.71,32.4,7.5,1.7,48,42.352941176470587,48,124.22679150676709,42.248160533857096,1.1834834787642574,0.32102420824397382,910.13281764867634,3.82,0,0.82997238980017696,105.25024261736019,16.038,0,0.24,20.8,878.76173910422767,0.91037190674173629,"Good"]
["W12X72",1.0611895174011527,21.1,0.43,0.67,12,8.99,22.6,5.31,3.04,67.79661016949153,23.684210526315788,67.79661016949153,62.270418417848084,35.728483292956781,1.3994436760727704,0.56348188137809208,249.8200007176433,6,0,0.53239070187763693,216.31978755188345,9.718,0,0.33898305084745767,21.1,753.87099748138814,1.0611895174011527,"No Good"]
["W21X73",0.8621164086126063,21.5,0.45500000000000002,0.74,8.3000000000000007,5.6,41.2,8.64,1.81,41.666666666666664,39.77900552486188,41.666666666666664,164.86187191579666,44.039338902787591,1.1353485598494102,0.3896919159027516,643.82900000000018,4.1500000000000004,0,1.0775373782008972,65.090662815769633,17.802944295737806,-0.42909034543929936,0.20833333333333331,21.070909654560701,927.94893126721774,0.8621164086126063,"Good"]
["W14X74",0.95163481318664589,21.8,0.45,0.78500000000000003,10.1,6.41,25.4,6.04,2.48,59.602649006622514,29.032258064516128,59.602649006622514,80.568748747258212,38.562321594286317,1.2966024329668049,0.41740013927203717,491.39476977519035,5.05,0,0.62162723732899061,171.25595928141863,11.43,0,0.29801324503311255,21.8,840.65861075544171,0.95163481318664589,"Good"]
["W18X76",0.8407915233122516,22.3,0.42499999999999999,0.68,11,8.11,37.799999999999997,7.73,2.61,46.57179818887451,27.586206896551726,46.57179818887451,131.96286311510585,42.667460918918451,1.1718531856164507,0.55549765245146621,306.97632339548238,5.5,0,0.97309430788840001,77.326708861734019,16.064999999999998,0,0.23285899094437254,22.3,951.48437849188144,0.8407915233122516,"Good"]
["W24X76",0.85447511268365828,22.4,0.44,0.68,8.99,6.61,49,9.69,1.92,37.151702786377712,37.5,37.5,203.53317520468718,45.114416168344576,1.108293185340687,0.46555618882004113,462.10819438754373,4.4950000000000001,0,1.2970851385659239,46.017282253227826,17.816203641676584,-1.6472703976623027,0.1875,20.752729602337695,936.2472799089868,0.85447511268365828,"Good"]
["W10X77",1.1327814604683153,22.6,0.53,0.87,10.199999999999999,5.86,14.8,4.49,2.6,80.178173719376389,27.69230769230769,80.178173719376389,44.523102923654669,31.248949001920646,1.6000538129114954,0.34350123094010376,587.96484059220256,5.0999999999999996,0,0.32605747097047216,504.41697721877279,7.8440000000000012,0,0.40089086859688194,22.6,706.22624744340669,1.1327814604683153,"No Good"]
["W16X77",0.8590110737316432,22.6,0.45500000000000002,0.76,10.3,6.77,31.2,7,2.4700000000000002,51.428571428571431,29.1497975708502,51.428571428571431,108.2153383792282,41.208118464319185,1.213353141645946,0.45571469744122167,440.52367273290594,5.15,0,0.78933383498984122,113.50211075156149,14.196,0,0.25714285714285717,22.6,931.30347729361358,0.8590110737316432,"Good"]
["W12X79",0.96150617944017158,23.2,0.47,0.73499999999999999,12.1,8.2200000000000006,20.7,5.34,3.05,67.415730337078656,23.606557377049182,67.415730337078656,62.976026593606534,35.863273016889956,1.3941839601882486,0.51619019723916904,298.81538470646035,6.05,0,0.48855114929999244,257.85314637447789,9.7289999999999992,0,0.3370786516853933,23.2,832.02793399184691,0.96150617944017158,"Good"]
["W14X82",0.86366031868908577,24,0.51,0.85499999999999998,10.1,5.92,22.4,6.05,2.48,59.504132231404959,29.032258064516128,59.504132231404959,80.835753531136746,38.595420690311002,1.2954904780336287,0.38565820035604059,576.10703067932809,5.05,0,0.54844191742995807,220.1998857820472,11.423999999999999,0,0.2975206611570248,24,926.29009656746405,0.86366031868908577,"Good"]
["W21X83",0.74689932246904445,24.3,0.51500000000000001,0.83499999999999996,8.36,5,36.4,8.67,1.83,41.522491349480973,39.344262295081968,41.522491349480973,166.00873365498708,44.077976387444018,1.1343533459998614,0.34809180770213582,807.61909759999992,4.18,0,0.95241656485910575,83.389305858290072,18.745999999999999,0,0.20761245674740486,24.3,1071.0948262148897,0.74689932246904445,"Good"]
["W24X84",0.75670877658585889,24.7,0.47,0.77,9.02,5.86,45.9,9.7899999999999991,1.95,36.77221654749745,36.923076923076927,36.923076923076927,209.94327764643631,45.256270542022342,1.1048192747913885,0.41338048555055312,587.96484059220256,4.51,0,1.2169333669962912,52.443027463321336,18.723036612157586,-1.3394827922859331,0.18461538461538463,23.360517207714068,1057.2098867538762,0.75670877658585889,"Good"]
["W27X84",0.78382747979049194,24.8,0.46,0.64,10,7.78,52.7,10.7,2.0699999999999998,33.644859813084118,34.782608695652179,34.782608695652179,236.57750174548715,45.767011023372419,1.0924899590769839,0.55191074097541792,333.57031476133517,5,0,1.405081847075321,39.782483892571527,18.808566806212255,-2.4993792691423633,0.17391304347826089,22.300620730857638,1020.632754817209,0.78382747979049194,"Good"]
["W18X86",0.73988695871725518,25.3,0.48,0.77,11.1,7.2,33.4,7.77,2.63,46.332046332046332,27.376425855513308,46.332046332046332,133.3321184170471,42.737005953591158,1.1699462534716598,0.49356859353736443,389.47680246913586,5.55,0,0.86052451281905895,99.042180330954892,16.032,0,0.23166023166023167,25.3,1081.2462506258564,0.73988695871725518,"Good"]
["W12X87",0.86708575924418108,25.6,0.51500000000000001,0.81,12.1,7.48,18.899999999999999,5.38,3.07,66.914498141263948,23.452768729641694,66.914498141263948,63.923021228239442,36.040264376201854,1.3873372147906899,0.47087816895134221,360.86386227801768,6.05,0,0.44716779781260141,309.30683544693608,9.7334999999999994,0,0.33457249070631973,25.6,922.63076803076751,0.86708575924418108,"Good"]
["W10X88",0.97832513324662984,25.9,0.60499999999999998,0.99,10.3,5.18,13,4.54,2.63,79.295154185022028,27.376425855513308,79.295154185022028,45.520229970148989,31.572357530596328,1.583663809442982,0.30520822972203221,752.46632578524486,5.15,0,0.28788006431245561,653.77215792899415,7.8650000000000002,0,0.39647577092511016,25.9,817.72406004244488,0.97832513324662984,"Good"]
["W16X89",0.73895642019774355,26.2,0.52500000000000002,0.875,10.4,5.92,27,7.05,2.4900000000000002,51.063829787234042,28.915662650602407,51.063829787234042,109.7667929753794,41.320909204452441,1.2100411380738052,0.39904292503364835,576.10703067932809,5.2,0,0.68401154390857577,151.56034936899863,14.175000000000001,0,0.25531914893617019,26.2,1082.6078211566539,0.73895642019774355,"Good"]
["W30X90",0.76282042864298727,26.4,0.47,0.61,10.4,8.52,57.5,11.7,2.09,30.76923076923077,34.449760765550245,34.449760765550245,241.17113243587073,45.844189019421918,1.0906507688208307,0.60491550459770904,278.14252903965263,5.2,0,1.5343510136470238,33.417767770132329,19.527496323613445,-3.5238267279016799,0.17224880382775123,22.87617327209832,1048.7396115271231,0.76282042864298727,"Good"]
["W14X90",0.77631213299268176,26.5,0.44,0.71,14.5,10.199999999999999,25.9,6.14,3.7,58.631921824104239,19.45945945945946,58.631921824104239,83.258672872684713,38.887295409007358,1.285766970269129,0.66698645648957355,194.06456593617844,7.25,0,0.63652925154130646,164.70758439796666,11.395999999999999,0,0.29315960912052119,26.5,1030.5133283386949,0.77631213299268176,"Good"]
["W21X93",0.66424572519653857,27.3,0.57999999999999996,0.93,8.42,4.53,32.299999999999997,8.6999999999999993,1.84,41.379310344827587,39.130434782608695,41.379310344827587,167.15957065150579,44.116248238343964,1.1333692686165939,0.31550806269019266,983.89824227982194,4.21,0,0.84550570217049714,105.90295573618076,18.733999999999998,0,0.20689655172413793,27.3,1204.3735769067903,0.66424572519653857,"Good"]
["W24X94",0.65553240141259939,27.7,0.51500000000000001,0.875,9.07,5.18,41.9,9.8699999999999992,1.98,36.474164133738604,36.363636363636367,36.474164133738604,215.14291423174362,45.365430582136163,1.1021608162513246,0.36585184744949384,752.46632578524486,4.5350000000000001,0,1.1122214698446431,62.933962947351638,20.027327841725452,-0.79885366151139148,0.18237082066869303,26.901146338488608,1220.3820867985914,0.65553240141259939,"Good"]
["W27X94",0.68296595674528926,27.7,0.49,0.745,10,6.7,49.5,10.9,2.12,33.027522935779814,33.962264150943398,33.962264150943398,248.14439633245064,45.956116810918438,1.087994449263842,0.47627681320127435,449.77673067498341,5,0,1.3224875550374964,45.092335349454139,19.74213331451471,-2.2113046758877917,0.169811320754717,25.488695324112207,1171.3614596728112,0.68296595674528926,"Good"]
["W12X96",0.78150873809791555,28.2,0.55000000000000004,0.9,12.2,6.76,17.7,5.44,3.09,66.17647058823529,23.300970873786408,66.17647058823529,65.356764037949574,36.300034719108666,1.3774091508975761,0.42708389044120498,441.82796120584021,6.1,0,0.42028270541809543,352.66843719876152,9.7350000000000012,0,0.33088235294117646,28.2,1023.6609790788643,0.78150873809791555,"Good"]
["W18X97",0.6554991510186654,28.5,0.53500000000000003,0.87,11.1,6.41,30,7.82,2.65,46.035805626598467,27.169811320754718,46.035805626598467,135.05362568779418,42.822596177240804,1.1676078627519977,0.43985294113457613,491.39476977519035,5.55,0,0.77369979908290121,122.76388298888889,16.05,0,0.23017902813299235,28.5,1220.4439910513629,0.6554991510186654,"Good"]
["W14X99",0.70522921302882513,29.1,0.48499999999999999,0.78,14.6,9.34,23.5,6.17,3.71,58.346839546191248,19.40700808625337,58.346839546191248,84.074263167857168,38.982232197440517,1.2826356311961757,0.61149541112767791,231.4476823682075,7.3,0,0.57825040674016936,200.06789441376193,11.397499999999999,0,0.29173419773095621,29.1,1134.382956945519,0.70522921302882513,"Good"]
["W30X99",0.66863501763278566,29.1,0.52,0.67,10.5,7.8,51.9,11.7,2.1,30.76923076923077,34.285714285714285,34.285714285714285,243.48451135326351,45.882001150737992,1.0897519451196773,0.55402422189939815,331.86189086127553,5.25,0,1.3854895874448554,41.018371141330782,21.174641332150699,-3.0229465072816364,0.17142857142857143,26.077053492718363,1196.4673983607602,0.66863501763278566,"Good"]
["W10X100",0.85164973129556865,29.4,0.68,1.1200000000000001,10.3,4.62,11.6,4.5999999999999996,2.65,78.260869565217391,27.169811320754718,78.260869565217391,46.731358369478961,31.950793094652951,1.5649063812556074,0.2738392968830578,945.9379247015612,5.15,0,0.25841251526080705,821.10207112068997,7.8879999999999999,0,0.39130434782608697,29.4,939.35331698279674,0.85164973129556865,"Good"]
["W16X100",0.65453972445351905,29.5,0.58499999999999996,0.98499999999999999,10.4,5.29,24.3,7.1,2.5099999999999998,50.70422535211268,28.685258964143429,50.70422535211268,111.32928995299783,41.431624475410111,1.2068076169611757,0.35705459538726875,721.49818789955725,5.2,0,0.61643457124750434,187.1115424308625,14.215499999999999,0,0.25352112676056338,29.5,1222.2329220245983,0.65453972445351905,"Good"]
["W21X101",0.60323390448470371,29.8,0.5,0.8,12.3,7.68,37.5,9.02,2.89,39.911308203991133,24.913494809688579,39.911308203991133,179.68251462590527,44.502865943559286,1.1235231471027607,0.53723980661066717,342.31359592013899,6.15,0,0.98591617194700887,78.568885112888907,18.75,0,0.19955654101995568,29.8,1326.1854051180667,0.60323390448470371,"Good"]
["W27X102",0.61879711702107576,30,0.51500000000000001,0.83,10,6.03,47.1,11,2.15,32.727272727272727,33.488372093023258,33.488372093023258,255.21704166223589,46.063648477507726,1.0854546188284313,0.42915033201545011,555.2799144135596,5,0,1.2598382981334395,49.804812766801447,20.501517966099708,-1.9338157474586515,0.1674418604651163,28.066184252541348,1292.8308455140275,0.61879711702107576,"Good"]
["W24X103",0.58727070343689791,30.3,0.55000000000000004,0.98,9,4.59,39.200000000000003,10,1.99,36,36.180904522613062,36.180904522613062,218.64467424264376,45.436160232895823,1.1004451023966579,0.3244340819711346,958.34353548730087,4.5,0,1.0413617241201838,71.902003520668472,20.980491266723611,-0.31872980330201522,0.18090452261306531,29.981270196697984,1362.2337966429136,0.58727070343689791,"Good"]
["W24X104",0.59307975384745348,30.6,0.5,0.75,12.8,8.5,43.1,10.1,2.91,35.643564356435647,24.742268041237111,35.643564356435647,225.28666669520547,45.564557633327581,1.0973441331827651,0.60165215816799866,279.45297494809694,6.4,0,1.1465832206508344,59.478305290130862,19.557909280410954,-0.99604535979452358,0.17821782178217824,29.60395464020548,1348.891097378058,0.59307975384745348,"Good"]
["W18X106",0.60022446111903538,31.1,0.59,0.94,11.2,5.96,27.2,7.84,2.66,45.91836734693878,27.06766917293233,45.91836734693878,135.74532046290386,42.856421780699236,1.166686296300125,0.4091355220848169,568.40000000000009,5.6,0,0.7017648160438642,149.33971492484864,16.047999999999998,0,0.22959183673469391,31.1,1332.8347173797463,0.60022446111903538,"Good"]
["W12X106",0.70389384030044722,31.2,0.61,0.99,12.2,6.17,15.9,5.47,3.11,65.813528336380259,23.15112540192926,65.813528336380259,66.079598328796919,36.427404493383733,1.3725929885858721,0.39049210004071111,530.3667150876438,6.1,0,0.37820387225071433,437.03767528974328,9.6989999999999998,0,0.32906764168190128,31.2,1136.5350201935723,0.70389384030044722,"Good"]
["W30X108",0.60034145062946132,31.7,0.54500000000000004,0.76,10.5,6.89,49.6,11.9,2.15,30.252100840336134,33.488372093023258,33.488372093023258,255.21704166223589,46.063648477507726,1.0854546188284313,0.49035585200438658,425.31249807781847,5.25,0,1.326708696123537,44.910694706848339,21.94758433708574,-2.7710065362882741,0.1674418604651163,28.928993463711727,1332.5749857205356,0.60034145062946132,"Good"]
["W14X109",0.63876674034345204,32,0.52500000000000002,0.86,14.6,8.49,21.7,6.22,3.73,57.877813504823152,19.302949061662197,57.877813504823152,85.442414231651696,39.137917523003786,1.2775334806869041,0.55695424850527242,280.11167354096347,7.3,0,0.53502407315642331,234.63546622353414,11.3925,0,0.28938906752411575,32,1252.4133607361211,0.63876674034345204,"Good"]
["W21X111",0.54931247199843669,32.700000000000003,0.55000000000000004,0.875,12.3,7.05,34.1,9.0500000000000007,2.9,39.779005524861873,24.827586206896552,39.779005524861873,180.87972962458656,44.53718612154681,1.122657364646805,0.49335948078354042,406.22659705246224,6.15,0,0.89687206864129565,95.017668140108881,18.755000000000003,0,0.19889502762430936,32.700000000000003,1456.3659861745807,0.54931247199843669,"Good"]
["W10X112",0.75237854805520499,32.9,0.755,1.25,10.4,4.17,10.4,4.66,2.68,77.253218884120173,26.865671641791042,77.253218884120173,47.958387798121798,32.318982891452976,1.5470783894385154,0.24858668983809751,1161.1129766690246,5.2,0,0.23301126319622101,1021.5189967640533,7.8520000000000003,0,0.38626609442060089,32.9,1063.2945371288029,0.75237854805520499,"Good"]
["W27X114",0.53660167693562344,33.5,0.56999999999999995,0.93,10.1,5.41,42.5,11,2.1800000000000002,32.727272727272727,33.027522935779814,33.027522935779814,262.38906842522664,46.167007721964495,1.0830244901536452,0.3854571470453067,689.84585401853894,5.05,0,1.1380714435954176,61.16954723321799,22.107174606343193,-1.2071604743843787,0.16513761467889906,32.292839525615619,1490.8637717432566,0.53660167693562344,"Good"]
["W30X116",0.54663278580902031,34.200000000000003,0.56499999999999995,0.85,10.5,6.17,47.8,12,2.19,30,32.876712328767127,32.876712328767127,264.80182877582462,46.20057025434938,1.0822377240093251,0.43976615875232455,530.3667150876438,5.25,0,1.2804608288081782,48.35677539346301,22.541891545385234,-2.5227862768573397,0.16438356164383564,31.677213723142664,1463.505338078093,0.54663278580902031,"Good"]
["W24X117",0.51533994260123095,34.4,0.55000000000000004,0.85,12.8,7.53,39.200000000000003,10.1,2.94,35.643564356435647,24.489795918367346,35.643564356435647,225.28666669520547,45.564557633327581,1.0973441331827651,0.53299302953000349,356.08742436187089,6.4,0,1.0428320707543552,71.902003520668472,20.95955646752649,-0.33024394286043202,0.17821782178217824,34.069756057139564,1552.3733634189471,0.51533994260123095,"Good"]
["W33X118",0.56149362452209595,34.700000000000003,0.55000000000000004,0.74,11.5,7.76,54.5,13,2.3199999999999998,27.692307692307693,31.03448275862069,31.03448275862069,297.17257004712138,46.600016829176163,1.0729609859002265,0.55547911137216333,335.29196513975984,5.75,0,1.4662373278106993,37.198045514687315,22.474055132606978,-4.1255196770661637,0.15517241379310345,30.574480322933837,1424.7712975920322,0.56149362452209595,"Good"]
["W18X119",0.53058357399193612,35.1,0.65500000000000003,1.06,11.3,5.31,24.5,7.9,2.69,45.569620253164558,26.765799256505577,45.569620253164558,137.83100547444147,42.956517896969778,1.1639677154448098,0.3649404724823152,716.07340873383225,5.65,0,0.63284208375451723,184.0691290129113,16.047499999999999,0,0.22784810126582278,35.1,1507.7737781836393,0.53058357399193612,"Good"]
["W12X120",0.61929464563432912,35.299999999999997,0.71,1.1100000000000001,12.3,5.57,13.7,5.51,3.13,{"$f":"12*F$9/I166","v":65.335753176043553},{"$f":"12*F$10/J166","v":23.003194888178914},{"$f":"MAX(K166:L166)","v":65.335753176043553},{"$f":"+(PI()^2)*29000/(M166^2)","v":67.049561116881776},{"$f":"IF(M166<=D$22,C$10*0.658^(C$10/N166),0.877*N166)","v":36.594680219139512},{"$f":"+C$10/O166","v":1.3663188119307386},{"$f":"+G166/(D$25*SQRT(P166))","v":0.35332726155413358},{"$f":"+C$10*(D$31*D$25/G166)^2","v":650.78299817243578},6.15,{"$f":"-4*(F166/2-S166)*E166","v":0},{"$f":"+H166/(D$26*SQRT(P166))","v":0.32662113077528382},{"$f":"+C$10*(D$30*D$26/H166)^2","v":588.67011929245052},{"$f":"IF(H166<=D$26*SQRT(P166),1,(1-C$30*SQRT(V166/O166))*SQRT(V166/O166))*(H166*D166)","v":9.7269999999999985},{"$f":"-(H166*D166-W166)*D166","v":0},{"$f":"+M166/C$12","v":0.32667876588021777},{"$f":"+C166+T166+X166","v":35.299999999999997},1291.7922117356247,{"$f":"C$9/AA166","v":0.61929464563432912},"Good"]
["W14X120",0.57814501720983447,35.299999999999997,0.59,0.94,14.7,7.8,19.3,6.24,3.74,57.692307692307693,19.251336898395721,57.692307692307693,85.992766523980336,39.19931651021777,1.2755324442191971,0.5120906236977395,331.86189086127553,{"$f":"IF(G167<=D$25*SQRT(P167),1,(1-J161*SQRT(R167/O167))*SQRT(R167/O167))*(F167/2)","v":7.35},0,0.47622401143737475,296.61868691776959,11.387,0,0.28846153846153849,35.299999999999997,{"$f":"+O167*Z167","v":1383.7358728106872},0.57814501720983447,{"$f":"IF(AB167<=1,\"Good\", IF(AB167<=1.03,\"Close\",\"No Good\"))","v":"Good"}]
["W21X122",{"$f":"AB168","v":0.49984058586261049},35.9,0.6,0.96,12.4,6.45,31.3,9.09,2.92,39.603960396039604,24.657534246575342,39.603960396039604,182.48220002311649,44.582459273923902,1.1215173145292323,0.45160079671587355,485.31884958836605,6.2,0,0.8236469241804103,112.77801619900174,18.78,0,0.19801980198019803,35.9,1600.5102879338681,0.49984058586261049,"Good"]
["W30X124",0.50456889173778008,36.5,0.58499999999999996,0.93,10.5,5.65,46.2,12.1,2.23,29.75206611570248,32.286995515695068,32.286995515695068,274.56329399288978,46.33056532262551,1.0792011634613603,0.40326935590951463,632.48421771477797,5.25,0,1.2393401171338081,51.764160477689693,23.132515391131385,-2.2782734961881403,0.16143497757847533,34.221726503811858,1585.5119352378799,0.50456889173778008,"Good"]
["W27X129",0.46503560655347742,37.799999999999997,0.61,1.1000000000000001,10,4.55,39.700000000000003,11.2,2.21,32.142857142857146,32.579185520361989,32.579185520361989,269.66047662142279,46.266404435126546,1.0806977678610967,0.32453179033948809,975.26759763313623,5,0,1.0642364131318682,70.102275054089532,23.204626817554079,-0.61754764129201334,0.16289592760180993,37.182452358707984,1720.2983787178086,0.46503560655347742,"Good"]
["W18X130",0.4851541639549044,38.200000000000003,0.67,1.2,11.2,4.6500000000000004,23.9,8.0299999999999994,2.7,44.831880448318806,26.666666666666664,44.831880448318806,142.40453903055462,43.166502388115063,1.1583055664423345,0.32036079106153942,933.77164712683543,5.6,0,0.61885095295773163,193.42710157385204,16.013000000000002,0,0.22415940224159403,38.200000000000003,1648.9603912259956,0.4851541639549044,"Good"]
["W33X130",0.49573875015842955,38.299999999999997,0.57999999999999996,0.85499999999999998,11.5,6.73,51.7,13.2,2.39,27.272727272727273,30.1255230125523,30.1255230125523,315.37593589591307,46.789818990994839,1.068608536605431,0.48272936783331188,445.77577147853196,5.75,0,1.3937374131166718,41.336341821025179,23.41601577573406,-3.8105908500742456,0.15062761506276151,34.489409149925748,1613.753211231387,0.49573875015842955,"Good"]
["W24X131",0.45521329819352091,38.5,0.60499999999999998,0.96,12.9,6.7,35.6,10.199999999999999,2.97,35.294117647058826,24.242424242424242,35.294117647058826,229.76987357091636,45.647218263793093,1.0953569987781597,0.47467344369742626,449.77673067498341,6.45,0,0.94792044210677051,87.179250323507134,21.538,0,0.17647058823529413,38.5,1757.4179031560341,0.45521329819352091,"Good"]
["W14X132",0.52436979341757206,38.799999999999997,0.64500000000000002,1.03,14.7,7.15,17.7,6.28,3.76,57.324840764331206,19.148936170212767,57.324840764331206,87.098771451741939,39.320641577482569,1.2715967490376121,0.47014228476924874,394.94307672746834,7.35,0,0.43741965801218319,352.66843719876152,11.416499999999999,0,0.28662420382165604,38.799999999999997,1525.6408932063237,0.52436979341757206,"Good"]
["W21X132",0.46213313422762586,38.799999999999997,0.65,1.04,12.4,6.01,28.9,9.1199999999999992,2.93,39.473684210526322,24.573378839590443,39.473684210526322,183.68869062223013,44.616053630283872,1.1206728505019925,0.42095243186810766,558.98177026087978,6.2,0,0.76077836238857555,132.28708311682095,18.785,0,0.19736842105263161,38.799999999999997,1731.1028808550141,0.46213313422762586,"Good"]
["W30X132",0.46529288950886338,38.9,0.61499999999999999,1,10.5,5.27,43.9,12.2,2.25,29.508196721311478,32,32,279.51028089022594,46.393108332316608,1.0777462816642294,0.37640061542688885,726.98484637902436,5.25,0,1.1784359652146044,57.330282994588032,24.007280153277897,-1.8396002057340934,0.16,37.060399794265905,1719.3471424943423,0.46529288950886338,"Good"]
["W36X135",0.49028309162575301,39.700000000000003,0.6,0.79,12,7.56,54.1,14,2.38,25.714285714285715,30.252100840336137,30.252100840336137,312.7423279159695,46.763680310897982,1.0692058381116727,0.54211211261462156,353.26694101508929,6,0,1.4580295944544386,37.750142540855066,24.447808105108798,-4.8073151369347213,0.15126050420168069,34.892684863065284,1631.7103601252941,0.49028309162575301,"Good"]
["W12X136",0.54365015917602222,39.9,0.79,1.25,12.4,4.96,12.3,5.58,3.16,64.516129032258064,22.784810126582279,64.516129032258064,68.764001263489831,36.880565516014883,1.3557275844452055,0.31585913116676301,820.69773673257043,6.2,0,0.29438700144466656,730.30269475841089,9.7170000000000005,0,0.32258064516129031,39.9,1471.5345640889939,0.54365015917602222,"Good"]
["W33X141",0.4479927665075964,41.6,0.60499999999999998,0.96,11.5,6.01,49.6,13.4,2.4300000000000002,26.865671641791042,29.629629629629626,29.629629629629626,326.02079163035961,46.891304858387485,1.0662957695675312,0.43155246848443052,558.98177026087978,5.75,0,1.3385745641630329,44.910694706848339,24.194126709439477,-3.5173933407891158,0.14814814814814814,38.082606659210889,1785.7431186591152,0.4479927665075964,"Good"]
["W18X143",0.43925614323598894,42.1,0.73,1.32,11.2,4.25,22,8.09,2.72,44.499381953028433,26.470588235294116,44.499381953028433,144.54057730158297,43.260351823248492,1.1557927268896959,0.29312099597298935,1117.8118997923877,5.6,0,0.57027251012826363,228.27994770661161,16.059999999999999,0,0.22249690976514216,42.1,1821.2608117587615,0.43925614323598894,"Good"]
["W14X145",0.47467847376763472,42.7,0.68,1.0900000000000001,15.5,7.11,16.8,6.33,3.98,56.872037914691944,18.090452261306531,56.872037914691944,88.49121575476444,39.469586326405526,1.2667981768673751,0.46839673821317518,399.39938083680005,7.75,0,0.41596357461459449,391.4664636125284,11.424000000000001,0,0.28436018957345971,42.7,1685.351336137516,0.47467847376763472,"Good"]
["W24X146",0.40685801086348333,43,0.65,1.0900000000000001,12.9,5.92,33.200000000000003,10.3,3.01,34.95145631067961,23.920265780730897,34.95145631067961,234.29724997249636,45.727626508583803,1.0934309041956114,0.41978219173967202,576.10703067932809,6.45,0,0.88479395392980043,100.23905382675279,21.580000000000002,0,0.17475728155339806,43,1966.2879398691036,0.40685801086348333,"Good"]
["W27X146",0.40402951747706622,43.1,0.60499999999999998,0.97499999999999998,14,7.16,39.4,11.5,3.2,31.304347826086957,22.5,31.304347826086957,292.07098980924349,46.542731384622556,1.0742816012839269,0.51221457205064203,393.84065416185524,7,0,1.0593436989356759,71.173886656445674,22.915839159804356,-0.55730230831836414,0.15652173913043479,42.542697691681639,1980.0533510411406,0.40402951747706622,"Good"]
["W21X147",0.41455006216673324,43.2,0.72,1.1499999999999999,12.5,5.44,26.1,9.17,2.95,39.258451472191929,24.406779661016948,39.258451472191929,185.70834219259353,44.671368330588543,1.1192851678501798,0.3812646159315925,682.25823961937704,6.25,0,0.68749551254147223,162.19300170285226,18.792000000000002,0,0.19629225736095965,43.2,1929.8031118814251,0.41455006216673324,"Good"]
["W30X148",0.4080470638589157,43.5,0.65,1.18,10.5,4.4400000000000004,41.6,12.4,2.2799999999999998,29.032258064516128,31.578947368421055,31.578947368421055,287.01357909723464,46.484005062826014,1.0756388123704466,0.31742981358889527,1024.1902767632496,5.25,0,1.1177890043785756,63.844937297753333,25.004690736216212,-1.3229510214594642,0.15789473684210528,42.177048978540533,1960.558158253539,0.4080470638589157,"Good"]
["W40X149",0.44711646449218123,43.8,0.63,0.83,11.8,7.11,54.3,15,2.29,24,31.441048034934497,31.441048034934497,289.53676326250547,46.513551289748939,1.0749555476539034,0.5084781837529212,399.39938083680005,5.9,0,1.4595007137653579,37.472568904761431,25.744132656103012,-5.3328664266550998,0.15720524017467249,38.467133573344896,1789.2429904334012,0.44711646449218123,"Good"]
["W36X150",0.42904162600184809,44.2,0.625,0.94,12,6.37,51.9,14.3,2.4700000000000002,25.174825174825173,29.1497975708502,29.1497975708502,336.84232546828241,46.988104729401584,1.0640991009946779,0.45787440826221476,497.58550899649805,6,0,1.4020905251897009,41.018371141330782,25.210026912403634,-4.5171706797477285,0.145748987854251,39.682829320252274,1864.6209400589817,0.42904162600184809,"Good"]
["W12X152",0.48114388879026909,44.7,0.87,1.4,12.5,4.46,11.2,5.66,3.19,63.60424028268551,22.570532915360502,63.60424028268551,70.749863146563342,37.196963610186117,1.3441957393078146,0.285234187411539,1015.0253091757327,6.25,0,0.2692070941471052,880.79954312818882,9.7439999999999998,0,0.31802120141342755,44.7,1662.7042733753196,0.48114388879026909,"Good"]
["W33X152",0.4082400463567184,44.8,0.63500000000000001,1.06,11.6,5.48,47.2,13.5,2.4700000000000002,26.666666666666668,29.1497975708502,29.1497975708502,336.84232546828241,46.988104729401584,1.0640991009946779,0.39390137476874992,672.33461558953604,5.8,0,1.2751189362033506,49.593998981075842,25.097731515872816,-3.0951604874207628,0.145748987854251,41.704839512579234,1959.6313667399584,0.4082400463567184,"Good"]
["W18X158",0.39898372157425172,46.3,0.81,1.44,11.3,3.92,19.8,8.1199999999999992,2.74,44.334975369458135,26.277372262773721,44.334975369458135,145.61455932308942,43.30657311633594,1.154559144305491,0.27050540709112109,1313.9367346938777,5.65,0,0.5135193730013613,281.82709593408839,16.038,0,0.22167487684729067,46.3,2005.094335286354,0.39898372157425172,"Good"]
["W14X159",0.43242122781187048,46.7,0.745,1.19,15.6,6.54,15.3,6.38,4,56.426332288401255,18,56.426332288401255,89.894702439254232,39.615587494847887,1.2621294586758971,0.43164207616467865,472.05335877077329,7.8,0,0.37952397313167985,471.98724716989193,11.3985,0,0.2821316614420063,46.7,1850.0479360093964,0.43242122781187048,"Good"]
["W36X160",0.39710042786552252,47,0.65,1.02,12,5.88,49.9,14.4,2.5,25,28.8,28.8,345.07442085213074,47.057799226798494,1.0625231273358398,0.42296663130610213,583.97188208616797,6,0,1.3490594376589644,44.37230962526256,25.990786064005988,-4.1887390583961093,0.14400000000000002,42.811260941603891,2014.6037220360761,0.39710042786552252,"Good"]
["W27X161",0.3611030592551015,47.6,0.66,1.08,14,6.49,36.1,11.5,3.23,31.304347826086957,22.291021671826627,31.304347826086957,292.07098980924349,46.542731384622556,1.0742816012839269,0.46428387885595901,479.35492650777184,7,0,0.97061694242583518,84.781036586582374,23.826000000000001,0,0.15652173913043479,47.6,2215.4340139080336,0.3611030592551015,"Good"]
["W24X162",0.36614284107943446,47.7,0.70499999999999996,1.22,13,5.31,30.6,10.4,3.05,34.615384615384613,23.606557377049182,34.615384615384613,238.86879589994544,45.805862051425756,1.091563344968064,0.37684957128613172,716.07340873383225,6.5,0,0.81620018624592749,117.99681179247298,21.573,0,0.17307692307692307,47.7,2184.9396198530085,0.36614284107943446,"Good"]
["W21X166",0.36532060228508423,48.8,0.75,1.36,12.4,4.57,25,9.36,2.99,38.461538461538467,24.080267558528426,38.461538461538467,193.48372467895572,44.874125686888902,1.1142278369695067,0.32101636601987543,966.7500174767415,6.2,0,0.66001338232685536,176.77999150400001,18.75,0,0.19230769230769235,48.8,2189.8573335201781,0.36532060228508423,"Good"]
["W40X167",0.38758209583556513,49.2,0.65,1.03,11.8,5.76,52.6,15.3,2.4,23.52941176470588,30,30,318.02058625732371,46.815645956775477,1.0680190132624596,0.41326722831424589,608.5575038580248,5.9,0,1.4183910651128391,39.933891877141498,26.327705795086793,-5.1104912331935877,0.15,44.089508766806418,2064.0788328349577,0.38758209583556513,"Good"]
["W33X169",0.36216058183022143,49.5,0.67,1.22,11.5,4.71,44.7,13.7,2.5,26.277372262773724,28.8,28.8,345.07442085213074,47.057799226798494,1.0625231273358398,0.33880490364825527,910.13281764867634,5.75,0,1.2084760894460063,55.296555555555557,26.130380726319963,-2.5584749133656284,0.14400000000000002,46.941525086634371,2208.9648629265648,0.36216058183022143,"Good"]
["W12X170",0.42663512652013708,50,0.96,1.56,12.6,4.03,10.1,5.74,3.22,62.717770034843205,22.360248447204967,62.717770034843205,72.763993526193048,37.502772288124767,1.3332347703754284,0.25879132052310527,1243.1871041629468,6.3,0,0.24376300379347571,1083.1045455347517,9.6959999999999997,0,0.31358885017421601,50,1875.1386144062383,0.42663512652013708,"Good"]
["W36X170",0.36632027954689228,50.1,0.68,1.1000000000000001,12,5.47,47.7,14.5,2.5299999999999998,24.827586206896552,28.458498023715418,28.458498023715418,353.40589766918458,47.125127155165735,1.061005094699657,0.39375544089616266,674.79512447820764,6,0,1.2905040719014389,48.559741698860364,26.909798865911235,-3.7578167711803654,0.14229249011857709,46.342183228819636,2183.8812773061145,0.36632027954689228,"Good"]
["W30X173",0.34052834207227561,51,0.65500000000000003,1.07,15,7.04,40.799999999999997,12.7,3.42,28.346456692913389,21.05263157894737,28.346456692913389,356.20514137113707,47.147062175138664,1.0605114654708163,0.50688909871736609,407.38146952479343,7.5,0,1.1040842479688817,66.373206633266065,24.936198902328613,-1.1710097189747588,0.14173228346456695,49.828990281025241,2349.2905029038775,0.34052834207227561,"Good"]
["W18X175",0.35909294019522586,51.3,0.89,1.59,11.4,3.58,18,8.1999999999999993,2.76,43.902439024390247,26.086956521739133,43.902439024390247,148.49794597182253,43.427592594421924,1.1513417395009429,0.24738814160590888,1575.362616647421,5.7,0,0.46748762089677209,341.01078608024699,16.02,0,0.21951219512195125,51.3,2227.8355000938445,0.35909294019522586,"Good"]
["W24X176",0.3372539868842328,51.7,0.75,1.34,12.9,4.8099999999999996,28.7,10.5,3.04,34.285714285714285,23.684210526315788,34.285714285714285,243.48451135326351,45.882001150737992,1.0897519451196773,0.34164827017129551,872.68283937223657,6.45,0,0.76615705509956356,134.13722964950406,21.524999999999999,0,0.17142857142857143,51.7,2372.0994594931544,0.3372539868842328,"Good"]
["W14X176",0.38844350292575819,51.8,0.83,1.31,15.7,5.97,13.7,6.43,4.0199999999999996,55.987558320373253,17.910447761194032,55.987558320373253,91.309231505211272,39.758717362218832,1.2575858407221421,0.39473304778688056,566.49740719229885,7.85,0,0.34044854503175248,588.67011929245052,11.370999999999999,0,0.27993779160186627,51.8,2059.5015593629355,0.38844350292575819,"Good"]
["W27X178",0.32699763379816427,52.5,0.72499999999999998,1.19,14.1,5.92,32.9,11.6,3.25,31.03448275862069,22.153846153846153,31.03448275862069,297.17257004712138,46.600016829176163,1.0729609859002265,0.42376756950041322,576.10703067932809,7.05,0,0.88512308412792662,102.075456333552,23.852499999999999,0,0.15517241379310345,52.5,2446.5008835317485,0.32699763379816427,"Good"]
["W40X183",0.35318817812650644,53.3,0.65,1.2,11.8,4.92,52.6,15.7,2.4900000000000002,22.929936305732486,28.915662650602407,28.915662650602407,342.31934667604747,47.034836026039926,1.0630418690588921,0.35382449376108016,834.09666203979123,5.9,0,1.4217076292118704,39.933891877141498,26.278506042150966,-5.1424710726018761,0.14457831325301204,48.157528927398118,2265.081476519445,0.35318817812650644,"Good"]
["W21X182",0.33229994478634911,53.6,0.83,1.48,12.5,4.22,22.6,9.4,3,38.297872340425528,24,38.297872340425528,195.14096528956341,44.915364472674128,1.1132048150342695,0.29656704446332832,1133.761451899104,6.25,0,0.59692619274275338,216.31978755188345,18.757999999999999,0,0.19148936170212763,53.6,2407.4635357353332,0.33229994478634911,"Good"]
["W36X182",0.3355537367441434,53.6,0.72499999999999998,1.18,12.1,5.12,44.8,14.5,2.5499999999999998,24.827586206896552,28.235294117647062,28.235294117647062,359.0154274545568,47.168749673195485,1.0600238578809187,0.36873139563407836,770.20559082031252,6.05,0,1.2126066030919356,55.049971445511801,28.26545919725244,-3.0555420819919785,0.14117647058823532,50.544457918008021,2384.1188829018838,0.3355537367441434,"Good"]
["W12X190",0.37929940047556765,55.8,1.06,1.74,12.7,3.65,9.16,5.82,3.25,61.855670103092784,22.153846153846153,61.855670103092784,74.806392402378975,37.798418728709585,1.3228066591585423,0.23531123024289671,1515.5171656971293,6.35,0,0.22194584658526489,1316.8071581634601,9.7096,0,0.30927835051546393,55.8,2109.1517650619949,0.37929940047556765,"Good"]
["W24X192",0.30969859896829199,56.3,0.81,1.46,13,4.43,26.6,10.5,3.07,34.285714285714285,23.452768729641694,34.285714285714285,243.48451135326351,45.882001150737992,1.0897519451196773,0.3146573465402992,1028.8193794618064,6.5,0,0.71009678277520538,156.15282759059301,21.546000000000003,0,0.17142857142857143,56.3,2583.1566647865488,0.30969859896829199,"Good"]
["W30X191",0.30244425298971306,56.3,0.71,1.19,15,6.35,37.700000000000003,12.8,3.46,28.125,20.809248554913296,28.125,361.83675591944387,47.190193319421766,1.0595421735520167,0.45741729107177875,500.72484196168398,7.5,0,1.0206620355236902,77.737474188941007,26.418027917889631,-0.24777017829836134,0.140625,56.052229821701637,2645.115561270758,0.30244425298971306,"Good"]
["W18x192",0.32573779390051771,56.4,0.96,1.75,11.5,3.27,16.7,8.2799999999999994,2.79,43.478260869565219,25.806451612903224,43.478260869565219,151.40960111711183,43.545444921422195,1.1482257234993247,0.22627266547570427,1888.2134350830931,5.75,0,0.43431274090856192,396.16872132381957,16.032,0,0.21739130434782608,56.4,2455.9630935682117,0.32573779390051771,"Good"]
["W14X193",0.35251446489522859,56.8,0.89,1.44,15.7,5.45,12.8,6.5,4.05,55.384615384615387,17.777777777777779,55.384615384615387,93.308123398416157,39.954408811109644,1.2514263503780614,0.36123667054491304,679.75683662991332,7.85,0,0.31886515047914993,674.36215020751956,11.392000000000001,0,0.27692307692307694,56.8,2269.4104204710275,0.35251446489522859,"Good"]
["W36X194",0.30999470809541896,57,0.76500000000000001,1.26,12.1,4.8099999999999996,42.4,14.6,2.56,24.657534246575342,28.125,28.125,361.83675591944387,47.190193319421766,1.0595421735520167,0.34648459370948909,872.68283937223657,6.05,0,1.1479063741698796,61.458423087620147,29.412446026222465,-2.313018789939814,0.140625,54.686981210060189,2580.6892153583258,0.30999470809541896,"Good"]
["W27X194",0.29976941240228455,57.2,0.75,1.34,14,5.24,31.8,11.7,3.29,30.76923076923077,21.88449848024316,30.76923076923077,302.31831981086839,46.655907532170211,1.0716756493381672,0.37531643443968182,735.33292931647338,7,0,0.85604219792277458,109.25941882243582,23.85,0,0.15384615384615385,57.2,2668.717910840136,0.29976941240228455,"Good"]
["W40X199",0.31213405924735349,58.5,0.65,1.07,15.8,7.39,52.6,16,3.45,22.5,20.869565217391305,22.5,565.36993112413109,48.183054240027325,1.0377092276243309,0.53790375410337576,369.70703269055764,7.9,0,1.4389564149693528,39.933891877141498,26.025387712894037,-5.306997986618879,0.1125,53.193002013381118,2563.0013012006252,0.31213405924735349,"Good"]
["W21X201",0.30039130179272389,59.2,0.91,1.63,12.6,3.86,20.6,9.4700000000000006,3.02,38.014783526927133,23.841059602649008,38.014783526927133,198.05814162558633,44.986367557467133,1.1114478166330786,0.27148181396623117,1355.1019785766064,6.3,0,0.54453075875690149,260.36265126307853,18.746000000000002,0,0.19007391763463566,59.2,2663.1929594020544,0.30039130179272389,"Good"]
["W33X201",0.29263624442807062,59.2,0.71499999999999997,1.1499999999999999,15.7,6.85,41.7,14,3.56,25.714285714285715,20.224719101123597,25.714285714285715,432.8613535169128,47.640158705594153,1.0495347068213847,0.495781303903301,430.29415397730315,7.85,0,1.1343246959045599,63.539093726457672,27.275243458237505,-1.8162834273601842,0.12857142857142859,57.38371657263982,2733.7693646373946,0.29263624442807062,"Good"]
["W24X207",0.28678601628041961,60.7,0.87,1.57,13,4.1399999999999997,24.8,10.6,3.08,33.962264150943398,23.376623376623375,33.962264150943398,248.14439633245064,45.956116810918438,1.087994449263842,0.29429641890347397,1178.0016709841541,6.5,0,0.66257962353393762,179.64277882739336,21.576000000000001,0,0.169811320754717,60.7,2789.5362904227495,0.28678601628041961,"Good"]
["W12X210",0.34021791687960234,61.8,1.18,1.9,12.8,3.37,8.23,5.89,3.28,61.120543293718171,21.951219512195124,61.120543293718171,76.616680420122904,38.049094937440493,1.314091703947464,0.21797919295172408,1777.815903987884,6.4,0,0.20007219335150384,1631.223448132296,9.7113999999999994,0,0.30560271646859083,61.8,2351.4340671338223,0.34021791687960234,"Good"]
["W36X210",0.27874104335954802,61.8,0.83,1.36,12.2,4.4800000000000004,39.1,14.6,2.58,24.657534246575342,27.906976744186046,27.906976744186046,367.51253999361978,47.232363403249295,1.0585961911988573,0.32285746069188526,1005.9828124999999,6.1,0,1.0590374759272412,72.270259018452265,31.20531856624746,-1.0355755900146109,0.13953488372093023,60.764424409985388,2870.0473757217019,0.27874104335954802,"Good"]
["W14X211",0.32184899751630225,62,0.98,1.56,15.8,5.0599999999999996,11.6,6.55,4.07,54.961832061068705,17.690417690417689,54.961832061068705,94.74915417989466,40.09093054825513,1.2471648653756713,0.33595921611401736,788.57963098939251,7.9,0,0.289464820526389,821.10207112068997,11.368,0,0.27480916030534353,62,2485.6376939918182,0.32184899751630225,"Good"]
["W40X211",0.29101804386393476,62,0.75,1.42,11.8,4.17,45.6,15.8,2.5099999999999998,22.784810126582279,28.685258964143429,28.685258964143429,347.84053740968142,47.08049952529425,1.0620108219781574,0.30003336999843461,1161.1129766690246,5.9,0,1.2331051351584548,53.135337166243467,29.384969500128076,-3.6112728749039453,0.14342629482071714,58.388727125096054,2748.9704396956204,0.29101804386393476,"Good"]
["W18x211",0.29515723134768884,62.1,1.06,1.91,11.6,3.02,15.1,8.35,2.82,43.113772455089823,25.531914893617024,43.113772455089823,153.98048837032118,43.646051313854187,1.1455790041682175,0.20921479657321548,2213.7710451295998,5.8,0,0.39315532241946533,484.57302175343199,16.006,0,0.21556886227544911,62.1,2710.4197865903452,0.29515723134768884,"Good"]
["W30X211",0.27230770191610476,62.2,0.77500000000000002,1.32,15.1,5.74,34.5,12.9,3.49,27.906976744186046,20.630372492836674,27.906976744186046,367.51253999361978,47.232363403249295,1.0585961911988573,0.41366112151147799,612.80571088637726,7.55,0,0.93444483170050685,92.827132694812036,26.737500000000001,0,0.13953488372093023,62.2,2937.8530036821062,0.27230770191610476,"Good"]
["W40X215",0.28557720434115957,63.4,0.65,1.22,15.8,6.45,52.6,16.2,3.54,22.222222222222221,20.338983050847457,22.222222222222221,579.5925184539725,48.226839952741898,1.0367670792653145,0.46969624866650322,485.31884958836605,7.9,0,1.4396100827969949,39.933891877141498,26.01588556186643,-5.3131743847868238,0.1111111111111111,58.086825615213172,2801.3440423077141,0.28557720434115957,"Good"]
["W27X217",0.26760608348668508,64,0.83,1.5,14.1,4.71,28.7,11.8,3.32,30.508474576271183,21.686746987951807,30.508474576271183,307.5082391004845,46.710447823664467,1.0704243339467403,0.33755216410232775,910.13281764867634,7.05,0,0.77304298742538546,134.13722964950406,23.820999999999998,0,0.15254237288135591,64,2989.4686607145259,0.26760608348668508,"Good"]
["W33X221",0.26024086354063264,65.2,0.77500000000000002,1.28,15.8,6.2,38.5,14.1,3.59,25.531914893617021,20.055710306406684,25.531914893617021,439.06717190151761,47.672724268261788,1.0488177625143105,0.44888970865818595,525.24655150884496,7.9,0,1.0476360812589836,74.540391087873175,28.912202838220239,-0.71710530037931663,0.1276595744680851,64.482894699620687,3074.0752590343764,0.26024086354063264,"Good"]
["W24X229",0.25864017030160952,67.2,0.96,1.73,13.1,3.79,22.5,10.7,3.11,33.644859813084118,23.15112540192926,33.644859813084118,252.84845083750685,46.028278943983594,1.08628871526676,0.26962772801553947,1405.6207795824314,6.55,0,0.60160248144991191,218.24690309135804,21.599999999999998,0,0.16822429906542058,67.2,3093.1003450356975,0.25864017030160952,"Good"]
["W12X230",0.30831811453663299,67.7,1.29,2.0699999999999998,12.9,3.11,7.56,5.97,3.31,60.301507537688444,21.75226586102719,60.301507537688444,78.712082727351728,38.326774971778896,1.3045710221331284,0.20189450623557545,2087.4967628539825,6.45,0,0.18445382541680491,1933.1677215433506,9.7523999999999997,0,0.30150753768844224,67.7,2594.7226655894315,0.30831811453663299,"Good"]
["W44X230",0.27367317264912383,67.7,0.71,1.22,15.8,6.45,54.8,17.5,3.43,{"$f":"12*F$9/I230","v":20.571428571428573},{"$f":"12*F$10/J230","v":20.991253644314867},{"$f":"MAX(K230:L230)","v":20.991253644314867},{"$f":"+(PI()^2)*29000/(M230^2)","v":649.5625686213175},{"$f":"IF(M230<=D$22,C$10*0.658^(C$10/N230),0.877*N230)","v":48.414780200142829},{"$f":"+C$10/O230","v":1.0327424764359974},{"$f":"+G230/(D$25*SQRT(P230))","v":0.47061056312878413},{"$f":"+C$10*(D$31*D$25/G230)^2","v":485.31884958836605},7.9,{"$f":"-4*(F230/2-S230)*E230","v":0},{"$f":"+H230/(D$26*SQRT(P230))","v":1.5027414766449332},{"$f":"+C$10*(D$30*D$26/H230)^2","v":36.791882455778158},{"$f":"IF(H230<=D$26*SQRT(P230),1,(1-C$30*SQRT(V230/O230))*SQRT(V230/O230))*(H230*D230)","v":28.595533944161776},{"$f":"-(H230*D230-W230)*D230","v":-7.3218508996451348},{"$f":"+M230/C$12","v":0.10495626822157433},{"$f":"+C230+T230+X230","v":60.378149100354868},2923.1948175851326,{"$f":"C$9/AA230","v":0.27367317264912383},"Good"]
["W36X231",0.25358752518811445,68.099999999999994,0.76,1.26,16.5,6.54,42.2,15.1,3.71,23.841059602649008,19.40700808625337,23.841059602649008,503.55467967036378,47.964609294521935,1.042435260818658,0.47495359357247829,472.05335877077329,{"$f":"IF(G231<=D$25*SQRT(P231),1,(1-J225*SQRT(R231/O231))*SQRT(R231/O231))*(F231/2)","v":8.25},0,1.1518280199602662,62.042347819006757,29.008870468904519,-2.3279784436325679,0.11920529801324503,65.77202155636742,{"$f":"+O231*Z231","v":3154.7293164620378},0.25358752518811445,{"$f":"IF(AB231<=1,\"Good\", IF(AB231<=1.03,\"Close\",\"No Good\"))","v":"Good"}]
["W36X232",{"$f":"AB232","v":0.24896529294833764},68.099999999999994,0.87,1.57,12.1,3.86,37.299999999999997,14.8,2.62,24.324324324324323,27.480916030534349,27.480916030534349,378.9966167195787,47.313931572048716,1.0567711948405936,0.27841638962203852,1355.1019785766064,6.05,0,1.0111558136149705,79.413705762278198,32.237715725062266,-0.1855573191958291,0.13740458015267173,67.914442680804171,3213.2992937533932,0.24896529294833764,"Good"]
["W14X233",0.28976927900668004,68.5,1.07,1.72,15.9,4.62,10.7,6.63,4.0999999999999996,54.298642533936651,17.560975609756099,54.298642533936651,97.077771583712192,40.303900250651104,1.2405747257473489,0.30755903334717094,945.9379247015612,7.95,0,0.26771459481917664,965.04056852126837,11.449,0,0.27149321266968324,68.5,2760.8171671696005,0.28976927900668004,"Good"]
["W18x234",0.26564672958353641,68.8,1.1599999999999999,2.11,11.7,2.76,16.8,8.44,2.85,42.654028436018962,25.263157894736842,42.654028436018962,157.31771689735896,43.772068999206802,1.1422809372092064,0.19147875440731754,2650.5037597143469,5.85,0,0.4380488574710738,391.4664636125284,19.488,0,0.2132701421800948,68.8,3011.5183471454279,0.26564672958353641,"Good"]
["W40X235",0.2535847686134769,69,0.83,1.58,11.9,3.77,41.2,15.9,2.54,22.641509433962263,28.346456692913385,28.346456692913385,356.20514137113713,47.147062175138664,1.0605114654708163,0.27144487246654408,1420.5740869210367,5.95,0,1.1149086033411257,65.090662815769633,31.681854914547312,-2.0867404209257292,0.14173228346456693,66.913259579074264,3154.763609715807,0.2535847686134769,"Good"]
["W30X235",0.24454861753408863,69.2,0.83,1.5,15.1,5.0199999999999996,32.200000000000003,13,3.51,27.692307692307693,20.512820512820515,27.692307692307693,373.23249359366463,47.273600473357838,1.0576727708349334,0.36193120724557293,801.19670481420962,7.55,0,0.87252914904839352,106.5617594710852,26.726000000000003,0,0.13846153846153847,69.2,3271.3331527563623,0.24454861753408863,"Good"]
["W27X235",0.24678370811452222,69.400000000000006,0.91,1.61,14.2,4.41,26.2,11.8,3.33,30.508474576271183,21.621621621621621,30.508474576271183,307.5082391004845,46.710447823664467,1.0704243339467403,0.31605202626141515,1038.1722348198541,7.1,0,0.70570474810261674,160.95725000000002,23.841999999999999,0,0.15254237288135591,69.400000000000006,3241.7050789623145,0.24678370811452222,"Good"]
["W33X241",0.23635329859477419,71,0.83,1.4,15.9,5.66,35.9,14.1,3.62,25.531914893617021,19.88950276243094,25.531914893617021,439.06717190151761,47.672724268261788,1.0488177625143105,0.40979286306537621,630.25126546716785,7.95,0,0.9768866316155197,85.72830338839708,29.796999999999997,0,0.1276595744680851,71,3384.7634230465869,0.23635329859477419,"Good"]
["W36X247",0.23501721359470062,72.5,0.8,1.35,16.5,6.11,40.1,15.2,3.74,23.684210526315791,19.251336898395721,23.684210526315791,510.24636283952827,47.990758939534707,1.0418672491301255,0.44384669801683962,540.83422684499396,8.25,0,1.0948078791140228,68.710701233201291,30.118058607007363,-1.5695531143941139,0.11842105263157895,70.930446885605889,3404.0059779605826,0.23501721359470062,"Good"]
["W40X249",0.23863288288716092,73.3,0.75,1.42,15.8,5.55,45.6,16.3,3.55,22.085889570552148,20.281690140845072,22.085889570552148,586.77006640769685,48.248145260431201,1.0363092659855158,0.40424650021099906,655.48177712847996,7.9,0,1.2483026337007164,53.135337166243467,29.110776481762365,-3.8169176386782286,0.11042944785276074,69.483082361321763,3352.4298509115574,0.23863288288716092,"Good"]
["W24X250",0.23647101284718583,73.5,1.04,1.89,13.2,3.49,20.7,10.7,3.14,33.644859813084118,22.929936305732483,33.644859813084118,252.84845083750685,46.028278943983594,1.08628871526676,0.24828516379267354,1657.661056969976,6.6,0,0.55347428293391898,257.85314637447789,21.527999999999999,0,0.16822429906542058,73.5,3383.0785023827943,0.23647101284718583,"Good"]
["W12X252",0.27986702050275142,74,1.4,2.25,13,2.89,6.96,6.06,3.34,59.405940594059409,21.556886227544911,59.405940594059409,81.10320001027398,38.628384264034885,1.2943849698252252,0.18834933374508256,2417.4132780977238,6.5,0,0.17048149443924523,2280.8390864463599,9.7439999999999998,0,0.29702970297029707,74,2858.5004355385813,0.27986702050275142,"Good"]
["W36X256",0.22396992872021138,75.400000000000006,0.96,1.73,12.2,3.53,33.799999999999997,14.9,2.65,24.161073825503355,27.169811320754718,27.169811320754718,387.72561926945411,47.372786321020726,1.0554582890939961,0.25477226265353692,1620.3065139757168,6.1,0,0.91684495075881656,96.711857681803906,32.447999999999993,0,0.13584905660377358,75.400000000000006,3571.9080886049628,0.22396992872021138,"Good"]
["W14X257",0.26121732929159797,75.599999999999994,1.18,1.89,16,4.2300000000000004,9.7100000000000009,6.71,4.13,53.651266766020868,17.433414043583536,53.651266766020868,99.434657484085889,40.510369701383183,1.2342518809028002,0.2823166192710877,1128.4072140346168,8,0,0.24356622541902151,1171.857128508412,11.457800000000001,0,0.26825633383010433,75.599999999999994,3062.5839494245683,0.26121732929159797,"Good"]
["W18x258",0.24012558919392049,75.900000000000006,1.28,2.2999999999999998,11.8,2.56,12.5,8.5299999999999994,2.88,42.203985932004692,25,42.203985932004692,160.69072274035074,43.894465761064282,1.1390957637386605,0.17785161907921754,3080.8223632812501,5.9,0,0.32638457779848018,707.11996601600003,16,0,0.21101992966002345,75.900000000000006,3331.5899512647793,0.24012558919392049,"Good"]
["W27X258",0.22509596591824688,76,0.98,1.77,14.3,4.03,24.4,11.9,3.36,30.252100840336134,21.428571428571431,30.252100840336134,312.74232791596955,46.763680310897982,1.0692058381116727,0.28898304415832343,1243.1871041629468,7.15,0,0.65759560267446027,185.58098409365763,23.911999999999999,0,0.15126050420168066,76,3554.0397036282466,0.22509596591824688,"Good"]
["W30X261",0.21987437083809488,76.900000000000006,0.93,1.65,15.2,4.59,28.7,13.1,3.53,27.480916030534353,20.396600566572239,27.480916030534353,378.99661671957864,47.313931572048709,1.0567711948405936,0.33107026641584369,958.34353548730087,7.6,0,0.77802069304958854,134.13722964950406,26.691000000000003,0,0.13740458015267176,76.900000000000006,3638.441337890546,0.21987437083809488,"Good"]
["W44X262",0.23366938992415195,76.900000000000006,0.78500000000000003,1.42,15.8,5.57,49.6,17.7,3.47,20.338983050847457,20.749279538904897,20.749279538904897,664.80105504614755,48.450547420438092,1.0319800840662596,0.40655332132636079,650.78299817243578,7.9,0,1.3606478923717662,44.910694706848339,30.990238690864164,-6.2374226276716316,0.10374639769452448,70.662577372328371,3423.6405558283714,0.23366938992415195,"Good"]
["W36X262",0.21852583603477133,77,0.84,1.44,16.600000000000001,5.75,38.200000000000003,15.3,3.76,23.52941176470588,19.148936170212767,23.52941176470588,516.98221553456199,48.016411365033449,1.0413106389789688,0.41780695784543931,610.67606623818529,8.3000000000000007,0,1.0432128908350908,75.715779919684223,31.186291479280669,-0.75743515740423872,0.1176470588235294,76.242564842595755,3660.8943570073143,0.21852583603477133,"Good"]
["W33X263",0.21624363900528173,77.5,0.87,1.57,15.8,5.03,34.299999999999997,14.3,3.66,25.174825174825173,19.672131147540984,25.174825174825173,451.61131724833433,47.735881123001086,1.0474301264318335,0.36442102956033889,798.01419870439406,7.9,0,0.93396655447115828,93.912820924954772,29.840999999999998,0,0.12587412587412586,77.5,3699.5307870325842,0.21624363900528173,"Good"]
["W40X264",0.2188669785594376,77.599999999999994,0.96,1.73,11.9,3.45,35.6,15.8,2.52,22.784810126582279,28.571428571428573,28.571428571428573,350.61769634869938,47.102940874727608,1.0615048460132723,0.24828820039233562,1696.3224062171812,5.95,0,0.96291675187658854,87.179250323507134,34.176000000000002,0,0.14285714285714288,77.599999999999994,3655.1882118788621,0.2188669785594376,"Good"]
["W40X277",0.20956276064550525,81.400000000000006,0.83,1.58,15.8,5.03,41.2,16.399999999999999,3.58,21.951219512195124,20.11173184357542,21.951219512195124,593.99178388729013,48.269071182481817,1.0358599984444363,0.36645059407830166,798.01419870439406,7.9,0,1.1280969360447486,65.090662815769633,31.409655019115046,-2.3126663341345099,0.10975609756097562,79.087333665865501,3817.4721383503525,0.20956276064550525,"Good"]
["W12X279",0.25077870236915223,81.900000000000006,1.53,2.4700000000000002,13.1,2.66,6.35,6.16,3.38,58.441558441558442,21.301775147928996,58.441558441558442,83.801958040874325,38.950715015787196,1.2836734827520984,0.17408138282520172,2853.5357340720225,6.55,0,0.15618746463299624,2740.095348502698,9.7155000000000005,0,0.29220779220779219,81.900000000000006,3190.0635597929718,0.25077870236915223,"Good"]
["W24X279",0.21163565023034156,82,1.1599999999999999,2.09,13.3,3.18,18.600000000000001,10.8,3.17,33.333333333333329,22.712933753943219,33.333333333333329,257.59667486843227,46.098554522157286,1.0846327074305004,0.22640381879695684,1996.6058937542027,6.65,0,0.49770422873435122,319.36494013758812,21.576000000000001,0,0.16666666666666663,82,3780.0814708168973,0.21163565023034156,"Good"]
["W40X278",0.20712289678307752,82,1.03,1.81,12,3.31,33.299999999999997,15.8,2.52,22.784810126582279,28.571428571428573,28.571428571428573,350.61769634869938,47.102940874727608,1.0615048460132723,0.23821273718800895,1842.8526063106399,6,0,0.90070583813175265,99.637921425930458,34.298999999999999,0,0.14285714285714288,82,3862.441151727664,0.20712289678307752,"Good"]
["W27X281",0.20613153452592706,82.9,1.06,1.93,14.4,3.72,22.5,12,3.39,30,21.238938053097343,30,318.02058625732371,46.815645956775477,1.0680190132624596,0.26690175161961716,1459.0181986356806,7.2,0,0.60672621606537791,218.24690309135804,23.85,0,0.15,82.9,3881.0170498166872,0.20613153452592706,"Good"]
["W36X282",0.20087143554172698,82.9,0.88500000000000001,1.57,16.600000000000001,5.29,36.200000000000003,15.4,3.8,23.376623376623375,18.947368421052634,23.376623376623375,523.76223775546464,48.041579007324863,1.040765125400573,0.38448312439958232,721.49818789955725,8.3000000000000007,0,0.98885346517150685,84.313280035713177,32.037000000000006,0,0.11688311688311687,82.9,3982.6468997072316,0.20087143554172698,"Good"]
["W14X283",0.23590525880491856,83.3,1.29,2.0699999999999998,16.100000000000001,3.89,8.84,6.79,4.17,53.019145802650954,17.266187050359711,53.019145802650954,101.81981188101584,40.71058689097103,1.2281817536531072,0.26026529255275666,1334.2812590453407,8.0500000000000007,0,0.22229038564779185,1413.867123548863,11.403600000000001,0,0.26509572901325479,83.3,3391.1918880178869,0.23590525880491856,"Good"]
["W18x283",0.21826748266991519,83.3,1.4,2.5,11.9,2.38,11.3,8.61,2.91,41.811846689895475,24.742268041237111,41.811846689895475,163.71898543393434,44.000331240996111,1.1363550816502459,0.16554569980985376,3564.451211072666,5.95,0,0.29540724956199732,865.2791502075338,15.82,0,0.20905923344947738,83.3,3665.2275923749758,0.21826748266991519,"Good"]
["W44X290",0.20470621340753822,85.4,0.86499999999999999,1.58,15.8,5.0199999999999996,45,17.8,3.49,20.224719101123593,20.630372492836674,20.630372492836674,672.48655254736627,48.467981186117377,1.0316088843890499,0.36647483375866152,801.19670481420962,7.9,0,1.2346808485144352,54.561725772839509,33.412131342193994,-4.7686313890021923,0.10315186246418337,80.631368610997811,3908.0396568487372,0.20470621340753822,"Good"]
["W33X291",0.19542750053814065,85.7,0.96,1.73,15.9,4.5999999999999996,31,14.4,3.68,25,19.565217391304348,25,457.94964421054618,47.766507387579871,1.0467585497574159,0.33337463214155089,954.18135349716465,7.95,0,0.84438045141192364,114.97137844953176,29.759999999999998,0,0.125,85.7,4093.5896831155951,0.19542750053814065,"Good"]
["W30X292",0.1966734852831836,85.9,1.02,1.85,15.3,4.12,26.2,13.2,3.58,27.272727272727273,20.11173184357542,27.272727272727273,384.8049093713617,47.353382779531096,1.0558907741140919,0.29729369215085816,1189.4663399000851,7.65,0,0.71054490311419016,160.95725000000002,26.724,0,0.13636363636363635,85.9,4067.6555807617215,0.1966734852831836,"Good"]
["W40X294",0.19652817759090033,86.3,1.06,1.93,12,3.11,32.200000000000003,15.9,2.5499999999999998,22.641509433962263,28.235294117647062,28.235294117647062,359.0154274545568,47.168749673195485,1.0600238578809187,0.22397551570741867,2087.4967628539825,6,0,0.87156099597232883,106.5617594710852,34.132000000000005,0,0.14117647058823532,86.3,4070.6630967967703,0.19652817759090033,"Good"]
["W40X297",0.18999017649091493,87.4,0.93,1.65,15.8,4.8,36.799999999999997,16.3,3.54,22.085889570552148,20.338983050847457,22.085889570552148,586.77006640769685,48.248145260431201,1.0363092659855158,0.34961859477708029,876.32280555555565,7.9,0,1.0074021254426833,81.586347095049646,34.08707628492315,-0.1273390550214677,0.11042944785276074,87.27266094497854,4210.7440225376859,0.18999017649091493,"Good"]
["W36X302",0.18752524781992311,88.8,0.94499999999999995,1.68,16.7,4.96,33.9,15.4,3.82,23.376623376623375,18.848167539267017,23.376623376623375,523.76223775546464,48.041579007324863,1.040765125400573,0.36049835482456111,820.69773673257043,8.35,0,0.92602575882083094,96.142127800837116,32.035499999999999,0,0.11688311688311687,88.8,4266.0922158504472,0.18752524781992311,"Good"]
["W12X305",0.22689757328644172,89.6,1.63,2.71,13.2,2.4500000000000002,5.98,6.29,3.42,57.233704292527818,21.05263157894737,57.233704292527818,87.376376921829063,39.350669552114404,1.2706264104040736,0.16115920693267988,3363.6780408163263,6.6,0,0.14784000881417847,3089.6604817060211,9.7474000000000007,0,0.2861685214626391,89.6,3525.8199918694504,0.22689757328644172,"Good"]
["W24X306",0.19296650158639558,89.8,1.26,2.2799999999999998,13.4,2.94,17.100000000000001,10.9,3.2,33.027522935779814,22.5,33.027522935779814,262.38906842522664,46.167007721964495,1.0830244901536452,0.2094720910005918,2335.8875283446719,6.7,0,0.45790639259956806,377.85128651550906,21.546000000000003,0,0.16513761467889906,89.8,4145.7972934324116,0.19296650158639558,"Good"]
["W27X307",0.18902991385176277,90.4,1.1599999999999999,2.09,14.4,3.46,20.6,12,3.41,30,21.114369501466275,30,318.02058625732371,46.815645956775477,1.0680190132624596,0.24824732811932132,1686.5312439440011,7.2,0,0.55549155781985715,260.36265126307853,23.896000000000001,0,0.15,90.4,4232.1343944925029,0.18902991385176277,"Good"]
["W14X311",0.21385349044301205,91.4,1.41,2.2599999999999998,16.2,3.59,8.09,6.88,4.2,52.325581395348841,17.142857142857142,52.325581395348841,104.53690026485182,40.928652656673563,1.2216380641557063,0.24083585650840411,1566.5984466290611,8.1,0,0.20397501716656527,1688.1696289120696,11.406899999999998,0,0.26162790697674421,91.4,3740.8788528199639,0.21385349044301205,"Good"]
["W18x311",0.19785490318917182,91.6,1.52,2.74,12,2.19,10.4,8.7200000000000006,2.95,41.284403669724767,24.406779661016948,41.284403669724767,167.92900379214507,44.141561888906708,1.1327193207580084,0.15257414217897319,4209.7699047142478,6,0,0.27231522296293098,1021.5189967640533,15.808000000000002,0,0.20642201834862384,91.6,4043.3670690238541,0.19785490318917182,"Good"]
["W33X318",0.17882072430306364,93.6,1.04,1.89,16,4.2300000000000004,28.7,14.5,3.71,24.827586206896552,19.40700808625337,24.827586206896552,464.33214069862714,47.796521238350195,1.0461012371729224,0.30665601360078398,1128.4072140346168,8,0,0.78197842997315437,134.13722964950406,29.847999999999999,0,0.12413793103448276,93.6,4473.7543879095783,0.17882072430306364,"Good"]
["W40X324",0.17391143730441744,95.3,1,1.81,15.9,4.4000000000000004,34.200000000000003,16.399999999999999,3.58,21.951219512195124,20.11173184357542,21.951219512195124,593.99178388729013,48.269071182481817,1.0358599984444363,0.32055320356750044,1042.896561983471,7.95,0,0.93642998089151464,94.462821628877265,34.200000000000003,0,0.10975609756097562,95.3,4600.0424836905167,0.17391143730441744,"Good"]
["W30X326",0.17634918983116357,95.8,1.1399999999999999,2.0499999999999998,15.4,3.75,23.4,13.2,3.6,27.272727272727273,20,27.272727272727273,384.8049093713617,47.353382779531096,1.0558907741140919,0.27059498678779564,1435.7672846222224,7.7,0,0.63460880659816976,201.78153022499822,26.675999999999995,0,0.13636363636363635,95.8,4536.4540702790791,0.17634918983116357,"Good"]
["W40X327",0.17643269853314286,96,1.18,2.13,12.1,2.85,29,16,2.58,22.5,27.906976744186046,27.906976744186046,367.51253999361978,47.232363403249295,1.0585961911988573,0.20538923280622165,2485.7466839027397,6.05,0,0.78547536577723764,131.37633137931039,34.22,0,0.13953488372093023,96,4534.3068867119327,0.17643269853314286,"Good"]
["W36X330",0.17158439812236348,97,1.02,1.85,16.600000000000001,4.49,31.4,15.5,3.83,23.225806451612904,18.798955613577021,23.225806451612904,530.58642950223623,48.066273919210381,1.0402304136168288,0.32642209184053411,1001.5068099860617,8.3000000000000007,0,0.85795519692141398,112.06082872530328,32.027999999999999,0,0.11612903225806452,97,4662.4285701634071,0.17158439812236348,"Good"]
["W40X331",0.17379549803040889,97.5,1.22,2.13,12.2,2.86,28,15.9,2.57,22.641509433962263,28.015564202334634,28.015564202334634,364.66912676579813,47.211396716919332,1.059066316122804,0.20606414508735493,2468.3942295466777,6.1,0,0.75822166306137095,140.92792690051024,34.159999999999997,0,0.14007782101167318,97.5,4603.1111798996344,0.17379549803040889,"Good"]
["W24X335",0.17584751577746599,98.4,1.38,2.48,13.5,2.73,15.6,11,3.23,32.727272727272727,22.291021671826627,32.727272727272727,267.22563150789006,46.233700060349889,1.0814622220314158,0.19465024141430357,2709.0766600920451,6.75,0,0.41804078693004798,454.00844300624595,21.527999999999999,0,0.16363636363636364,98.4,4549.3960859384297,0.17584751577746599,"Good"]
["W44X335",0.16949320697745379,98.5,1.03,1.77,15.9,4.5,38,17.8,3.49,20.224719101123593,20.630372492836674,20.630372492836674,672.48655254736627,48.467981186117377,1.0316088843890499,0.32851329719401934,997.06061432098772,7.95,0,1.0426193831899675,76.514885519390603,38.055449062320676,-1.1170874658097043,0.10315186246418337,97.382912534190297,4719.9531725564493,0.16949320697745379,"Good"]
["W12X336",0.20394956612799114,98.8,1.78,2.96,13.4,2.2599999999999998,5.47,6.41,3.47,56.162246489859591,20.749279538904897,56.162246489859591,90.742094793052402,39.701805429786276,1.2593885708403454,0.14932294323499276,3953.0263607173629,6.7,0,0.13583359259886854,3692.6527841742741,9.7365999999999993,0,0.28081123244929795,98.8,3922.5383764628841,0.20394956612799114,"Good"]
["W27X336",0.17259660441909325,98.9,1.26,2.2799999999999998,14.6,3.19,18.899999999999999,12.1,3.45,29.75206611570248,20.869565217391305,29.75206611570248,323.34301412454698,46.866384154287019,1.0668627610655204,0.2289994193339607,1984.1076090054153,7.3,0,0.50992612278947225,309.30683544693608,23.814,0,0.1487603305785124,98.9,4635.0853928589868,0.17259660441909325,"Good"]
["W14X342",0.19242780214188576,101,1.54,2.4700000000000002,16.399999999999999,3.31,7.41,6.98,4.24,51.575931232091691,16.981132075471699,51.575931232091691,107.59784840757858,41.162409958658472,1.214700501020654,0.2226852054161059,1842.8526063106399,8.1999999999999993,0,0.18736278683563601,2012.2257861772671,11.4114,0,0.25787965616045844,101,4157.4034058245061,0.19242780214188576,"Good"]
["W33X354",0.1609386518727573,104,1.1599999999999999,2.09,16.100000000000001,3.85,25.7,14.5,3.74,24.827586206896552,19.251336898395721,24.827586206896552,464.33214069862714,47.796521238350195,1.0461012371729224,0.27910771923475608,1362.150611570248,8.0500000000000007,0,0.70023852440104772,167.28110143984014,29.811999999999998,0,0.12413793103448276,104,4970.8382087884202,0.1609386518727573,"Good"]
["W30X357",0.16076660521344238,105,1.24,2.2400000000000002,15.5,3.45,21.6,13.3,3.64,27.06766917293233,19.780219780219781,27.06766917293233,390.65737154901387,47.39197925422485,1.0550308467132157,0.24904882235570439,1696.3224062171812,7.75,0,0.58603142791841278,236.81304588906031,26.784000000000002,0,0.13533834586466165,105,4976.1578216936095,0.16076660521344238,"Good"]
["W36X361",0.15693678771749231,106,1.1200000000000001,2.0099999999999998,16.7,4.16,28.6,15.6,3.85,23.076923076923077,18.7012987012987,23.076923076923077,537.4547907748771,48.090507783979199,1.0397062186283865,0.30250738825563722,1166.7019600591718,8.35,0,0.78164660723772039,135.07689213408972,32.032000000000004,0,0.11538461538461538,106,5097.5938251017951,0.15693678771749231,"Good"]
["W40X362",0.15482901893561779,107,1.1200000000000001,2.0099999999999998,16,3.99,30.5,16.5,3.6,21.818181818181817,20,21.818181818181817,601.2576708927528,48.289626617912525,1.0354190641319441,0.29074536058058903,1268.2381040320099,8,0,0.83529810410530703,118.7718298199409,34.160000000000004,0,0.10909090909090909,107,5166.9900481166405,0.15482901893561779,"Good"]
["W27X368",0.15788681937633889,108,1.38,2.48,14.7,2.96,17.3,12.2,3.48,29.508196721311478,20.689655172413794,29.508196721311478,328.7096115176393,46.915932797095095,1.0657360307902874,0.21260078455996451,2304.4281227173124,7.35,0,0.46700444422658643,369.16534027197707,23.873999999999999,0,0.1475409836065574,108,5066.9207420862704,0.15788681937633889,"Good"]
["W14X370",0.17742949794277346,109,1.66,2.66,16.5,3.1,6.89,7.07,4.2699999999999996,50.919377652050919,16.861826697892273,50.919377652050919,110.3904666806507,41.365441633902414,1.2087384547351441,0.20907085753826399,2100.9862060353798,8.25,0,0.1746436451018917,2327.4195725489294,11.437399999999998,0,0.25459688826025462,109,4508.8331380953632,0.17742949794277346,"Good"]
["W24X370",0.1585239119795355,109,1.52,2.72,13.7,2.5099999999999998,14.2,11.1,3.27,32.432432432432435,22.01834862385321,32.432432432432435,272.10636411642258,46.298690523306561,1.0799441503605856,0.17908988166541587,3204.7868192568385,6.85,0,0.38079166261220548,547.9443299444556,21.584,0,0.16216216216216217,109,5046.5572670404154,0.1585239119795355,"Good"]
["W40X372",0.15198811950560648,109,1.1599999999999999,2.0499999999999998,16.100000000000001,3.93,29.5,16.5,3.6,21.818181818181817,20,21.818181818181817,601.2576708927528,48.289626617912525,1.0354190641319441,0.28637324989516666,1307.258541007064,8.0500000000000007,0,0.80791128101988707,126.96063739155414,34.22,0,0.10909090909090909,109,5263.5693013524651,0.15198811950560648,"Good"]
["W33X387",0.1467309171751279,114,1.26,2.2799999999999998,16.2,3.55,23.7,14.6,3.77,24.657534246575342,19.098143236074272,24.657534246575342,470.75880671257727,47.825938764312816,1.0454577848727864,0.25743825253876235,1602.1009672683995,8.1,0,0.64594394322609971,196.70546865708849,29.861999999999998,0,0.12328767123287671,114,5452.1570191316614,0.1467309171751279,"Good"]
["W30X391",0.14667002108831453,115,1.36,2.44,15.6,3.19,19.7,13.4,3.67,26.865671641791042,19.618528610354225,26.865671641791042,396.55400325253515,47.429745271132802,1.0541907765722607,0.23037166078033633,1984.1076090054153,7.8,0,0.53469528554599532,284.6955466257827,26.792000000000002,0,0.13432835820895522,115,5454.4207061802726,0.14667002108831453,"Good"]
["W40X392",0.14690654248543888,115,1.42,2.52,12.4,2.4500000000000002,24.1,16.100000000000001,2.64,22.360248447204967,27.27272727272727,27.27272727272727,384.80490937136182,47.353382779531096,1.0558907741140919,0.17678872470135981,3363.6780408163263,6.2,0,0.65359283072717489,190.23001444534358,34.222000000000001,0,0.13636363636363635,115,5445.6390196460761,0.14690654248543888,"Good"]
["W36X395",0.14333686411391997,116,1.22,2.2000000000000002,16.8,3.83,26.3,15.7,3.88,22.929936305732486,18.556701030927837,22.929936305732486,544.3673215733869,48.114291928814296,1.0391922648259198,0.27857927093502394,1376.4138715241088,8.4,0,0.71896463846549374,159.73556750856599,32.085999999999999,0,0.11464968152866244,116,5581.2578637424585,0.14333686411391997,"Good"]
["W14X398",0.1645165755601552,117,1.77,2.85,16.600000000000001,2.92,6.44,7.16,4.3099999999999996,{"$f":"12*F$9/I294","v":50.279329608938546},{"$f":"12*F$10/J294","v":16.705336426914155},{"$f":"MAX(K294:L294)","v":50.279329608938546},{"$f":"+(PI()^2)*29000/(M294^2)","v":113.21886226967679},{"$f":"IF(M294<=D$22,C$10*0.658^(C$10/N294),0.877*N294)","v":41.561811108247134},{"$f":"+C$10/O294","v":1.2030274587836349},{"$f":"+G294/(D$25*SQRT(P294))","v":0.1973981406490741},{"$f":"+C$10*(D$31*D$25/G294)^2","v":2367.9955714017647},8.3000000000000007,{"$f":"-4*(F294/2-S294)*E294","v":0},{"$f":"+H294/(D$26*SQRT(P294))","v":0.16362431149140871},{"$f":"+C$10*(D$30*D$26/H294)^2","v":2664.0439867771302},{"$f":"IF(H294<=D$26*SQRT(P294),1,(1-C$30*SQRT(V294/O294))*SQRT(V294/O294))*(H294*D294)","v":11.398800000000001},{"$f":"-(H294*D294-W294)*D294","v":0},{"$f":"+M294/C$12","v":0.25139664804469275},{"$f":"+C294+T294+X294","v":117},4862.7318996649146,{"$f":"C$9/AA294","v":0.1645165755601552},"Good"]
["W40X397",0.14153658217245638,117,1.22,2.2000000000000002,16.100000000000001,3.66,28,16.600000000000001,3.64,21.686746987951807,19.780219780219781,21.686746987951807,608.5677274240843,48.309820208004602,1.0349862571360873,0.26675450956593516,1507.246964674968,{"$f":"IF(G295<=D$25*SQRT(P295),1,(1-J289*SQRT(R295/O295))*SQRT(R295/O295))*(F295/2)","v":8.0500000000000007},0,0.76699136501886223,140.92792690051024,34.159999999999997,0,0.10843373493975904,117,{"$f":"+O295*Z295","v":5652.2489643365388},0.14153658217245638,{"$f":"IF(AB295<=1,\"Good\", IF(AB295<=1.03,\"Close\",\"No Good\"))","v":"Good"}]
["W14X426",{"$f":"AB296","v":0.15321076911331055},125,1.88,3.04,16.7,2.75,6.08,7.26,4.34,49.586776859504134,16.589861751152075,49.586776859504134,116.4034850848369,41.772520541729882,1.1969591336977388,0.18637643851556826,2669.8151986776866,8.35,0,0.15486869990428478,2988.8627156011953,11.430399999999999,0,0.24793388429752067,125,5221.5650677162357,0.15321076911331055,"Good"]
["W40X431",0.13039196940297162,127,1.34,2.36,16.2,3.44,25.5,16.600000000000001,3.65,21.686746987951807,19.726027397260275,21.686746987951807,608.5677274240843,48.309820208004602,1.0349862571360873,0.25072008549366581,1706.1990805840999,8.1,0,0.6985099931421781,169.91540898116111,34.17,0,0.10843373493975904,127,6135.3471664165845,0.13039196940297162,"Good"]
["W36X441",0.12790058644011321,130,1.36,2.44,17,3.48,23.6,15.7,3.92,22.929936305732486,18.367346938775512,22.929936305732486,544.3673215733869,48.114291928814296,1.0391922648259198,0.25312163520989117,1667.20153256705,8.5,0,0.6451545805241693,198.37599592430337,32.096000000000004,0,0.11464968152866244,130,6254.8579507458589,0.12790058644011321,"Good"]
["W14X455",0.14243290923629187,134,2.02,3.21,16.8,2.62,5.66,7.33,4.38,49.113233287858115,16.438356164383563,49.113233287858115,118.65900192334112,41.91551858164356,1.1928756148539446,0.17786958311830567,2941.3317172658935,8.4,0,0.14441708864485417,3448.8973108042296,11.433200000000001,0,0.24556616643929058,134,5616.6794899402375,0.14243290923629187,"Good"]
["W36X487",0.11621687111825274,143,1.5,2.68,17.100000000000001,3.19,21.4,15.8,3.96,22.784810126582279,18.181818181818183,22.784810126582279,551.32402189776587,48.137637337639099,1.038688285619384,0.23208444967000139,1984.1076090054153,8.5500000000000007,0,0.58515496094029096,241.26014213031709,32.099999999999994,0,0.11392405063291139,143,6883.6821392823913,0.11621687111825274,"Good"]
["W14X500",0.12893078066692656,147,2.19,3.5,17,2.4300000000000002,5.21,7.48,4.43,48.128342245989302,16.252821670428894,48.128342245989302,123.5651320092484,42.210066848252097,1.1845515473773878,0.16554926907515527,3419.2750834053063,8.5,0,0.13340142719741294,4070.4055279047743,11.4099,0,0.24064171122994651,147,6204.879826693058,0.12893078066692656,"Good"]
["W40X503",0.11179937653785153,148,1.54,2.76,16.399999999999999,2.98,22.3,16.8,3.72,21.428571428571427,19.35483870967742,21.428571428571427,623.32034906435456,48.349155181337849,1.0341442329751267,0.21728196645379363,2273.6000000000004,8.1999999999999993,0,0.61110247220282321,222.1792006475095,34.341999999999999,0,0.10714285714285714,148,7155.6749668380016,0.11179937653785153,"Good"]
["W36X529",0.10643171565377753,156,1.61,2.91,17.2,2.96,19.899999999999999,16,4,22.5,18,22.5,565.36993112413109,48.183054240027325,1.0377092276243309,0.21545265387631829,2304.4281227173124,8.6,0,0.54439605813479308,279.00177947526583,32.039000000000001,0,0.1125,156,7516.5564614442628,0.10643171565377753,"Good"]
["W27X539",0.10671813489014503,159,1.97,3.54,15.3,2.15,12.1,12.7,3.65,28.346456692913389,19.726027397260275,28.346456692913389,356.20514137113707,47.147062175138664,1.0605114654708163,0.1548027787276047,4367.8696462952958,7.65,0,0.32743675001037914,754.64445522846802,23.837,0,0.14173228346456695,159,7496.3828858470479,0.10671813489014503,"Good"]
["W14X550",0.11622386935899554,162,2.38,3.82,17.2,2.25,4.79,7.63,4.49,47.182175622542594,16.035634743875278,47.182175622542594,128.57064352836105,42.48930647528865,1.17676667725983,0.15379255546931112,3988.2424572839509,8.6,0,0.12305239397192549,4815.5078948400678,11.4002,0,0.23591087811271297,162,6883.2676489967616,0.11622386935899554,"Good"]
["W40X593",9.5019071408091405E-2,174,1.79,3.23,16.7,2.58,19.100000000000001,17,3.8,21.176470588235293,18.947368421052634,21.176470588235293,638.24964880810114,48.387140405518288,1.0333324015629941,0.18819048366151797,3033.2428099272884,8.35,0,0.52361620447520851,302.86311967873689,34.189,0,0.10588235294117647,174,8419.3624305601825,9.5019071408091405E-2,"Good"]
["W14X605",0.10503705740588309,178,2.6,4.16,17.399999999999999,2.09,4.3899999999999997,7.8,4.55,46.153846153846153,15.824175824175825,46.153846153846153,134.36369769371927,42.78853705035516,1.1685372636404492,0.14335834519012175,4622.2562303976583,8.6999999999999993,0,0.11317303741543154,5733.0282994588051,11.414,0,0.23076923076923075,178,7616.3595949632181,0.10503705740588309,"Good"]
["W36X652",8.6397256605442882E-2,192,1.97,3.54,17.600000000000001,2.48,16.3,16.2,4.0999999999999996,22.222222222222221,17.560975609756099,22.222222222222221,579.5925184539725,48.226839952741898,1.0367670792653145,0.18059638708417486,3282.7909469302817,8.8000000000000007,0,0.44611491158918282,415.85115996085665,32.111000000000004,0,0.1111111111111111,192,9259.5532709264444,8.6397256605442882E-2,"Good"]
["W14X665",9.4730395195633421E-2,196,2.83,4.5199999999999996,17.7,1.95,4.03,7.98,4.62,45.112781954887218,15.584415584415584,45.112781954887218,140.63665375764498,43.086832316407005,1.1604473411465093,0.13422081410869244,5309.7902537804084,8.85,0,0.10425384039941393,6803.0401449427072,11.404900000000001,0,0.22556390977443608,196,8445.0191340157726,9.4730395195633421E-2,"Good"]
["W14X730",8.5770131866926738E-2,215,3.07,4.91,17.899999999999999,1.82,3.71,8.17,4.6900000000000004,44.063647490820074,15.351812366737738,44.063647490820074,147.41336326410749,43.382587289608018,1.152536146961828,0.12570197077522424,6095.4224852071011,8.9499999999999993,0,9.6304452571209509E-2,8027.2226073626316,11.389699999999999,0,0.22031823745410037,215,9327.2562672657241,8.5770131866926738E-2,"Good"]
["W36X800",7.0168559805836431E-2,236,2.38,4.29,18,2.1,13.5,16.600000000000001,4.22,21.686746987951807,17.061611374407583,21.686746987951807,608.5677274240843,48.309820208004602,1.0349862571360873,0.15305586614438904,4578.3395555555562,9,0,0.36979940813409429,606.24139747599452,32.129999999999995,0,0.10843373493975904,236,11401.117569089087,7.0168559805836431E-2,"Good"]

{"sheet":"SteelProps","index":3,"n_rows":10,"n_cols":3,"rows_kept":10,"cut":false,"hidden":true,"merged":[]}
[]
[null,"Fy","Fu"]
["A36",36,58]
["A36, PL of 8\" thick",32,58]
["A500 Gr B, Rect HSS",46,58]
["A500 Gr B, Rnd HSS",42,58]
["A53 Gr. B, Pipe",35,60]
["A572 Gr 50",50,65]
["A588",50,70]
["A992",50,65]

{"sheet":"StlSubTables","index":4,"n_rows":369,"n_cols":10,"rows_kept":369,"cut":false,"hidden":true,"merged":[]}
[]
[]
[]
[]
[]
[null,"RndHSS",null,null,null,"RectHSS",null,null,"IShapes"]
[null,"----",{"$f":"VLOOKUP(B7,StlSects,4)","v":{"$error":"#N/A"}},null,null,"----",{"$f":"VLOOKUP(F7,StlSects,4)","v":{"$error":"#N/A"}},null,"----",{"$f":"VLOOKUP(I7,StlSects,4)","v":{"$error":"#N/A"}}]
[null,"HSS1.660X0.140",2.2748621470494093,{"$f":"VLOOKUP(B8,StlSects,5)","v":0.625},null,"HSS2X1X1/8",2.1941785277614949,null,"S3X5.7",5.7]
[null,"HSS1.900X0.120",2.2834142603841814,0.624,null,"HSS2-1/2X1X1/8",2.6195257499837168,null,"S3X7.5",7.5]
[null,"HSS1.900X0.145",2.7203738010827001,0.749,null,"HSS2X2X1/8",2.6195257499837168,null,"S4X7.7",7.7]
[null,"HSS2.375X0.125",3.0066023442558567,0.82299999999999995,null,"HSS2X2X1/8",2.6195257499837168,null,"W6X8.5",8.5]
[null,"HSS2.500X0.125",3.1736358078256264,0.86899999999999999,null,"HSS2X1X3/16",3.0283108541300297,null,"W6X9",9]
[null,"HSS1.900X0.188",3.4406862368455564,0.94299999999999995,null,"HSS2-1/2X1-1/2X1/8",3.0448729722059391,null,"S4X9.5",9.5]
[null,"HSS2.375X0.154",3.6563919154318465,1,null,"HSS3X1X1/8",3.0448729722059391,null,"S5X10",10]
[null,"HSS2.875X0.125",3.6747361985349354,1.01,null,"HSS2-1/4X2X1/8",3.2575465833170503,null,"W8X10",10]
[null,"HSS3X0.125",3.8417696621047055,1.05,null,"HSS2-1/2X2X1/8",3.4702201944281614,null,"W10X12",12]
[null,"HSS3X0.134",4.1054847669240715,1.1200000000000001,null,"HSS2-1/4X2-1/4X1/8",3.4702201944281614,null,"W6X12",12]
[null,"HSS2.375X0.188",4.3953158878395042,1.2,null,"HSS3X1-1/2X1/8",3.4702201944281614,null,"S6X12.5",12.5]
[null,"HSS3.500X0.125",4.5099035163837851,1.23,null,"HSS2-1/2X1X3/16",3.6680330763522528,null,"W4X13",13]
[null,"HSS3X0.152",4.6277195677119378,1.27,null,"HSS2X1-1/2X3/16",3.6680330763522528,null,"W8X13",13]
[null,"HSS2.500X0.188",4.6465342170484387,1.27,null,"HSS2-1/2X2-1/2X1/8",3.8955674166503838,null,"W12X14",14]
[null,"HSS2.375X0.218",5.026782556195748,1.39,null,"HSS3-1/2X1-1/2X1/8",3.8955674166503838,null,"W10X15",15]
[null,"HSS4X0.125",5.1780373706628637,1.42,null,"HSS3X2X1/8",3.8955674166503838,null,"W6X15",15]
[null,"HSS2.875X0.188",5.4001892046752396,1.48,null,"HSS2X2X3/16",4.2988808541300294,null,"W8X15",15]
[null,"HSS3X0.188",5.6514075338841723,1.54,null,"HSS2-1/2X1-1/2X3/16",4.3077552985744747,null,"W12X16",16]
[null,"HSS2.375X0.250",5.6791377613721741,1.57,null,"HSS3X1X3/16",4.3077552985744747,null,"W5X16",16]
[null,"HSS2.875X0.203",5.7985038832422591,1.59,null,"HSS3-1/2X2X1/8",4.3209146388726056,null,"W6X16",16]
[null,"HSS4.500X0.125",5.8461712249419433,1.6,null,"HSS3X2-1/2X1/8",4.3209146388726056,null,"W10X17",17]
[null,"HSS2.500X0.250",6.0132046885117134,1.66,null,"HSS2-1/4X2X3/16",4.6276164096855856,null,"S6X17.2",17.3]
[null,"HSS3X0.203",6.0697662280795646,1.67,null,"HSS3X3X1/8",4.7462618610948279,null,"W8X18",18]
[null,"HSS3X0.216",6.4284525514815769,1.77,null,"HSS4X2X1/8",4.7462618610948279,null,"S8X18.4",18.399999999999999]
[null,"HSS5X0.125",6.5143050792210229,1.78,null,"HSS2-1/4X2-1/4X3/16",4.9369016874633633,null,"W10X19",19]
[null,"HSS3.500X0.188",6.6562808507199067,1.82,null,"HSS2-1/2X2X3/16",4.9474775207966966,null,"W12X19",19]
[null,"HSS2.875X0.250",7.0154054699303323,1.93,null,"HSS3X1-1/2X3/16",4.9474775207966966,null,"W5X19",19]
[null,"HSS3.500X0.203",7.154815607428791,1.97,null,"HSS4X2-1/2X1/8",5.1716090833170503,null,"W6X20",20]
[null,"HSS3X0.250",7.3494723970698708,2.0299999999999998,null,"HSS2-1/2X1-1/2X1/4",5.3752379697845996,null,"W8X21",21]
[null,"HSS3.500X0.216",7.5829878516758242,2.08,null,"HSS2X2X1/4",5.3752379697845996,null,"W10X22",22]
[null,"HSS4X0.188",7.6611541675556438,2.09,null,"HSS2-1/2X2-1/2X3/16",5.5749225207966964,null,"W12X22",22]
[null,"HSS5.563X0.134",{"$f":"VLOOKUP(B39,StlSects,4)","v":7.7769284018251126},2.12,null,"HSS3-1/2X1-1/2X3/16",5.5871997430189184,null,"W14X22",22]
[null,"HSS6X0.125",7.850572787779182,{"$f":"VLOOKUP(B40,StlSects,5)","v":2.14},null,"HSS3X2X3/16",5.5871997430189184,null,"S8X23",23]
[null,"HSS4.500X0.188",8.6660274843913871,2.36,null,"HSS3-1/2X3-1/2X1/8",5.5969563055392726,null,"W8X24",24]
[null,"HSS3.500X0.250",8.6857401056280317,2.39,null,"HSS4X3X1/8",5.5969563055392726,null,"W6X25",25]
[null,"HSS6.625X0.125",8.6857401056280317,2.37,null,"HSS5X2X1/8",5.5969563055392726,null,"S10X25.4",25.4]
[null,"HSS4X0.220",8.8899218114957161,2.44,null,"HSS5X2-1/2X1/8",6.0223035277614949,null,"W10X26",26]
[null,"HSS4X0.226",9.1178783924340685,2.5,null,"HSS2-1/2X2X1/4",6.2259324142290442,null,"W12X26",26]
[null,"HSS7X0.125",9.1868404963373393,2.5099999999999998,null,"HSS2-1/4X2-1/4X1/4",6.2259324142290442,null,"W14X26",26]
[null,"HSS4X0.237",9.533799734329051,2.61,null,"HSS3X1-1/2X1/4",6.2259324142290442,null,"W16X26",26]
[null,"HSS5X0.188",9.6709008012271269,2.64,null,"HSS3-1/2X2X3/16",6.2269219652411412,null,"W8X28",28]
[null,"HSS4X0.250",10,2.76,null,"HSS3X2-1/2X3/16",6.2269219652411412,null,"W10X30",30]
[null,"HSS3.500X0.300",10.262536001726657,2.82,null,"HSS4X4X1/8",6.4476507499837172,null,"W12X30",30]
[null,"HSS3.500X0.313",10.663747708685825,2.93,null,"HSS5X3X1/8",6.4476507499837172,null,"W14X30",30]
[null,"HSS4.500X0.237",10.80058152204219,2.96,null,"HSS6X2X1/8",6.4476507499837172,null,"W16X31",31]
[null,"HSS5.563X0.188",10.802388155984158,2.95,null,"HSS3X3X3/16",6.8509641874633633,null,"W8X31",31]
[null,"HSS6X0.188",11.680647434898594,3.18,null,"HSS4X2X3/16",6.8666441874633639,null,"S12X31.8",31.8]
[null,"HSS4X0.313",12.336754879800639,3.39,null,"HSS2-1/2X2-1/2X1/4",7.0766268586734888,null,"W10X33",33]
[null,"HSS5X0.250",12.694543231302506,3.49,null,"HSS3-1/2X1-1/2X1/4",7.0766268586734888,null,"W14X34",34]
[null,"HSS6.625X0.188",12.936739080943269,3.53,null,"HSS3X2X1/4",7.0766268586734888,null,"S10X35",35]
[null,"HSS5X0.258",13.078704162300477,3.59,null,"HSS4-1/2X4-1/2X1/8",7.2983451944281601,null,"S12X35",35]
[null,"HSS6.875X0.188",13.439175739361144,3.66,null,"HSS5X4X1/8",7.2983451944281601,null,"W12X35",35]
[null,"HSS7X0.188",13.690394068570063,3.73,null,"HSS6X3X1/8",7.2983451944281601,null,"W18X35",35]
[null,"HSS5.500X0.258",14.457732437532494,3.97,null,"HSS7X2X1/4",7.2983451944281601,null,"W8X35",35]
[null,"HSS5.563X0.258",14.631490000211729,4.01,null,"HSS4X2-1/2X3/16",7.5063664096855867,null,"W16X36",36]
[null,"HSS7.500X0.188",14.695267385405808,4,null,"HSS3-1/2X2X1/4",7.9273213031179326,null,"W14X38",38]
[null,"HSS4.500X0.337",14.997531141081645,4.12,null,"HSS3X2-1/2X1/4",7.9273213031179326,null,"W10X39",39]
[null,"HSS6X0.250",15.367078648418822,4.22,null,"HSS3-1/2X3-1/2X3/16",8.1270058541300294,null,"W12X40",40]
[null,"HSS5X0.312",15.635999852230725,4.3,null,"HSS4X3X3/16",8.1460886319078085,null,"W16X40",40]
[null,"HSS4.500X0.375",16.536312893407214,4.55,null,"HSS5X2X3/16",8.1460886319078085,null,"W18X40",40]
[null,"HSS8.625X0.188",16.956232348286186,4.62,null,"HSS5X5X1/8",8.1490396388726047,null,"W8X40",40]
[null,"HSS6.625X0.250",17.037413284116521,4.68,null,"HSS6X4X1/8",8.1490396388726047,null,"S12X40.8",40.799999999999997]
[null,"HSS6X0.280",17.121330896213987,4.6900000000000004,null,"HSS7X3X1/8",8.1490396388726047,null,"S15X42.9",42.9]
[null,"HSS6.875X0.250",{"$f":"VLOOKUP(B71,StlSects,4)","v":17.705547138395602},4.8600000000000003,null,"HSS8X2X1/8",{"$f":"VLOOKUP(F71,StlSects,4)","v":8.1490396388726047},null,"W14X43",{"$f":"VLOOKUP(I71,StlSects,4)","v":43}]
[null,"HSS7X0.250",18.03961406553514,{"$f":"VLOOKUP(B72,StlSects,5)","v":4.95},null,"HSS2-1/2X2-1/2X5/16",8.3983945487708098,null,"W21X44",44]
[null,"HSS5X0.375",18.540714456244448,5.0999999999999996,null,"HSS3X2X5/16",8.4074867709930334,null,"W10X45",45]
[null,"HSS9.625X0.188",18.965978981957644,5.17,null,"HSS3X3X1/4",8.7780157475623781,null,"W12X45",45]
[null,"HSS6X0.312",18.971324052791889,5.22,null,"HSS4X2X1/4",8.7780157475623781,null,"W16X45",45]
[null,"HSS6.625X0.280",18.992105688195416,5.2,null,"HSS5X2-1/2X3/16",8.7858108541300304,null,"W18X46",46]
[null,"HSS7.500X0.250",19.375881774093298,5.32,null,"HSS5-1/2X5-1/2X1/8",8.9997340833170494,null,"W14X48",48]
[null,"HSS10X0.188",19.719633969584432,5.37,null,"HSS6X5X1/8",8.9997340833170494,null,"W21X48",48]
[null,"HSS5.500X0.375",20.545116019081686,5.65,null,"HSS7X4X1/8",8.9997340833170494,null,"W8X48",48]
[null,"HSS5.563X0.375",20.797670615999177,5.72,null,"HSS8X3X1/8",8.9997340833170494,null,"W10X49",49]
[null,"HSS6.625X0.312",21.055901678142611,5.79,null,"HSS4X4X3/16",9.4030475207966973,null,"S12X50",50]
[null,"HSS6.875X0.312",21.889732728282898,6.02,null,"HSS5X3X3/16",9.4255330763522522,null,"S15X50",50]
[null,"HSS7X0.312",22.306648253353057,6.13,null,"HSS6X2X3/16",9.4255330763522522,null,"W12X50",50]
[null,"HSS8.625X0.250",22.382484118349154,6.14,null,"HSS3X2-1/2X5/16",9.4725562154374785,null,"W16X50",50]
[null,"HSS6X0.375",22.549517581918924,6.2,null,"HSS4X2-1/2X1/4",9.628710192006821,null,"W18X50",50]
[null,"HSS7.500X0.312",23.974310353633626,6.59,null,"HSS10X2X1/8",9.850428527761494,null,"W21X50",50]
[null,"HSS5X0.500",24.052818754046854,6.62,null,"HSS6X6X1/8",9.850428527761494,null,"W12X53",53]
[null,"HSS6.625X0.375",25.055019535465473,6.88,null,"HSS7X5X1/8",9.850428527761494,null,"W14X53",53]
[null,"HSS9.625X0.250",25.055019535465473,6.87,null,"HSS8X4X1/8",9.850428527761494,null,"W10X54",54]
[null,"HSS7.625X0.328",25.585956111571452,7.01,null,"HSS3-1/2X3-1/2X1/4",10.479404636451266,null,"S18X54.7",54.7]
[null,"HSS10X0.250",26.057220316884091,7.15,null,"HSS4X3X1/4",10.479404636451266,null,"W18X55",55]
[null,"HSS6.875X0.375",26.057220316884091,7.16,null,"HSS5X2X1/4",10.479404636451266,null,"W21X55",55]
[null,"HSS7X0.375",26.558320707593399,7.29,null,"HSS3X3X5/16",10.525130659881922,null,"W24X55",55]
[null,"HSS5.500X0.500",26.725354171163168,7.36,null,"HSS4X2X5/16",10.537625659881924,null,"W16X57",57]
[null,"HSS5.563X0.500",27.062093633719819,7.45,null,"HSS4-1/2X4-1/2X3/16",10.679089187463363,null,"W21X57",57]
[null,"HSS10.750X0.250",28.061621879721329,7.7,null,"HSS10X3X1/8",10.701122972205939,null,"W12X58",58]
[null,"HSS7.500X0.375",28.562722270430637,7.84,null,"HSS5X4X3/16",10.704977520796696,null,"W8X58",58]
[null,"HSS8.625X0.322",28.580799299992023,7.85,null,"HSS6X3X3/16",10.704977520796696,null,"W10X60",60]
[null,"HSS6.625X0.432",28.600148456411937,7.86,null,"HSS7X2X3/16",10.704977520796696,null,"W18X60",60]
[null,"HSS7.625X0.375",29.063822661139945,7.98,null,"HSS10X3-1/2X1/8",11.12647019442816,null,"W14X61",61]
[null,"HSS6X0.500",29.397889588279483,8.09,null,"HSS5X2-1/2X1/4",11.33009908089571,null,"W21X62",62]
[null,"HSS9.625X0.312",31.061874279826156,8.5299999999999994,null,"HSS10X4X1/8",11.551817416650383,null,"W24X62",62]
[null,"HSS10X0.312",{"$f":"VLOOKUP(B103,StlSects,4)","v":32.312620855036563},8.8800000000000008,null,"HSS7X7X1/8",11.551817416650383,null,"W12X65",65]
[null,"HSS6.625X0.500",32.738558859674882,{"$f":"VLOOKUP(B104,StlSects,5)","v":9},null,"HSS4X2-1/2X5/16",11.602695104326369,null,"W18X65",65]
[null,"HSS8.625X0.375",33.072625786814427,9.07,null,"HSS5X5X3/16",11.955130854130029,null,"S20X66",66]
[null,"HSS12.750X0.250",33.406692713953966,9.16,null,"HSS6X4X3/16",11.984421965241141,null,"W16X67",67]
[null,"HSS6.875X0.500",34.074826568233043,9.36,null,"HSS7X3X3/16",11.984421965241141,null,"W8X67",67]
[null,"HSS7X0.500",34.742960422512127,9.5500000000000007,null,"HSS8X2X3/16",11.984421965241141,null,"W10X68",68]
[null,"HSS14X0.250",36.747361985349357,10.1,null,"HSS3X3X3/8",12.093293169415546,null,"W14X68",68]
[null,"HSS9.625X0.375",37.081428912488896,10.199999999999999,null,"HSS4X2X3/8",12.093293169415546,null,"W21X68",68]
[null,"HSS7.500X0.500",37.415495839628434,10.3,null,"HSS4X4X1/4",12.180793525340155,null,"W24X68",68]
[null,"HSS10X0.375",38.58473008461683,10.6,null,"HSS5X3X1/4",12.180793525340155,null,"S18X70",70]
[null,"HSS10.750X0.375",41.591332428872683,11.4,null,"HSS6X2X1/4",12.180793525340155,null,"W18X71",71]
[null,"HSS16X0.250",42.092432819581994,11.5,null,"HSS3-1/2X3-1/2X5/16",12.651866770993035,null,"W12X72",72]
[null,"HSS8.625X0.500",43.428700528140148,11.9,null,"HSS4X3X5/16",12.667764548770812,null,"W21X73",73]
[null,"HSS14X0.312",45.653917657281234,12.5,null,"HSS5X2X5/16",12.667764548770812,null,"W14X74",74]
[null,"HSS9.625X0.500",48.773771362372784,13.4,null,"HSS5-1/2X5-1/2X3/16",13.231172520796697,null,"S20X75",75]
[null,"HSS12.750X0.375",49.608938680221634,13.6,null,"HSS8X8X1/8",13.253206305539271,null,"W18X76",76]
[null,"HSS10X0.500",50.778172925210022,13.9,null,"HSS6X5X3/16",13.263866409685585,null,"W24X76",76]
[null,"HSS16X0.312",52.324566058403583,14.4,null,"HSS7X4X3/16",13.263866409685585,null,"W10X77",77]
[null,"HSS8.625X0.625",53.450708342326337,14.7,null,"HSS8X3X3/16",13.263866409685585,null,"W16X77",77]
[null,"HSS14X0.375",54.619942587314732,15,null,"HSS4X2-1/2X3/8",13.369334836082214,null,"W12X79",79]
[null,"HSS10.750X0.500",54.786976050884491,15,null,"HSS4-1/2X4-1/2X1/4",13.882182414229042,null,"S24X80",80]
[null,"HSS10X0.625",62.637548838663676,17.2,null,"HSS5X4X1/4",13.882182414229042,null,"W14X82",82]
[null,"HSS16X0.375",62.637548838663676,17.2,null,"HSS6X3X1/4",13.882182414229042,null,"W21X83",83]
[null,"HSS12.750X0.500",65.477117719349764,17.899999999999999,null,"HSS7X2X1/2",13.882182414229042,null,"W24X84",84]
[null,"HSS18X0.375",70.655155090012627,19.399999999999999,null,"HSS6X6X3/16",14.507214187463363,null,"W27X84",84]
[null,"HSS14X0.500",72.158456262140561,19.8,null,"HSS10X2X3/16",14.543310854130031,null,"S20X86",86]
[null,"HSS16X0.438",72.865673274359466,19.899999999999999,null,"HSS7X5X3/16",14.543310854130031,null,"W18X86",86]
[null,"HSS20X0.375",78.672761341361593,21.5,null,"HSS8X4X3/16",14.543310854130031,null,"W12X87",87]
[null,"HSS16X0.500",82.84859793060582,22.7,null,"HSS9X3X3/16",14.543310854130031,null,"W10X88",88]
[null,"HSS14X0.625",89.362903009826852,24.5,null,"HSS3-1/2X3-1/2X3/8",14.64537650274888,null,"W16X89",89]
[null,"HSS18X0.500",93.538739599071093,25.6,null,"HSS4X3X3/8",14.64537650274888,null,"S24X90",90]
[null,"HSS16X0.625",103,28.1,null,"HSS5X2X3/8",14.64537650274888,null,"W14X90",90]
[null,"HSS20X0.500",{"$f":"VLOOKUP(B135,StlSects,4)","v":104},28.5,null,"HSS4X4X5/16",{"$f":"VLOOKUP(F135,StlSects,4)","v":14.778602882104146},null,"W30X90",{"$f":"VLOOKUP(I135,StlSects,4)","v":90}]
[null,null,null,null,null,"HSS5X3X5/16",14.7979034376597,null,"W21X93",93]
[null,null,null,null,null,"HSS6X2X5/16",14.7979034376597,null,"W24X94",94]
[null,null,null,null,null,"HSS9X9X1/8",14.95459519442816,null,"W27X94",94]
[null,null,null,null,null,"HSS5X5X1/4",15.583571303117932,null,"S20X96",96]
[null,null,null,null,null,"HSS6X4X1/4",15.583571303117932,null,"W12X96",96]
[null,null,null,null,null,"HSS7X3X1/4",15.583571303117932,null,"W18X97",97]
[null,null,null,null,null,"HSS8X2X1/4",15.583571303117932,null,"W14X99",99]
[null,null,null,null,null,"HSS10X3X3/16",15.822755298574476,null,"W30X99",99]
[null,null,null,null,null,"HSS10X3-1/2X3/16",16.4624775207967,null,"S24X100",100]
[null,null,null,null,null,"HSS4-1/2X4-1/2X5/16",16.905338993215253,null,"W10X100",100]
[null,null,null,null,null,"HSS5X4X5/16",16.928042326548585,null,"W16X100",100]
[null,null,null,null,null,"HSS6X3X5/16",16.928042326548585,null,"W21X101",101]
[null,null,null,null,null,"HSS7X7X3/16",17.059297520796697,null,"W27X102",102]
[null,null,null,null,null,"HSS10X4X3/16",17.102199743018918,null,"W24X103",103]
[null,null,null,null,null,"HSS12X2X3/16",17.102199743018918,null,"W24X104",104]
[null,null,null,null,null,"HSS8X6X3/16",17.102199743018918,null,"S24X106",106]
[null,null,null,null,null,"HSS9X5X3/16",17.102199743018918,null,"W12X106",106]
[null,null,null,null,null,"HSS4X4X3/8",17.197459836082214,null,"W18X106",106]
[null,null,null,null,null,"HSS5X3X3/8",17.197459836082214,null,"W30X108",108]
[null,null,null,null,null,"HSS6X2X3/8",17.197459836082214,null,"W14X109",109]
[null,null,null,null,null,"HSS5-1/2X5-1/2X1/4",17.284960192006821,null,"W21X111",111]
[null,null,null,null,null,"HSS6X5X1/4",17.284960192006821,null,"W10X112",112]
[null,null,null,null,null,"HSS7X4X1/4",17.284960192006821,null,"W27X114",114]
[null,null,null,null,null,"HSS8X3X1/4",17.284960192006821,null,"W30X116",116]
[null,null,null,null,null,"HSS10X5X3/16",18.381644187463365,null,"W24X117",117]
[null,null,null,null,null,"HSS12X3X3/16",18.381644187463365,null,"W33X118",118]
[null,null,null,null,null,"HSS10X2X1/4",18.98634908089571,null,"W18X119",119]
[null,null,null,null,null,"HSS6X6X1/4",18.98634908089571,null,"W12X120",120]
[null,null,null,null,null,"HSS7X5X1/4",18.98634908089571,null,"W14X120",120]
[null,null,null,null,null,"HSS8X4X1/4",18.98634908089571,null,"S24X121",121]
[null,null,null,null,null,"HSS9X3X1/4",18.98634908089571,null,"W21X122",122]
[null,null,null,null,null,"HSS5X5X5/16",19.032075104326363,null,"W30X124",124]
[null,null,null,null,null,"HSS6X4X5/16",19.058181215437475,null,"W27X129",129]
[null,null,null,null,null,"HSS7X3X5/16",19.058181215437475,null,"W18X130",130]
[null,null,null,null,null,"HSS8X2X5/16",19.058181215437475,null,"W33X130",130]
[null,null,null,null,null,"HSS8X8X3/16",19.611380854130029,null,"W24X131",131]
[null,null,null,null,null,"HSS10X6X3/16",19.661088631907809,null,"W14X132",132]
[null,null,null,null,null,"HSS12X4X3/16",19.661088631907809,null,"W21X132",132]
[null,null,null,null,null,"HSS9X7X3/16",19.661088631907809,null,"W30X132",132]
[null,null,null,null,null,"HSS4-1/2X4-1/2X3/8",19.749543169415549,null,"W36X135",135]
[null,null,null,null,null,"HSS5X4X3/8",19.749543169415549,null,"W12X136",136]
[null,null,null,null,null,"HSS6X3X3/8",19.749543169415549,null,"W33X141",141]
[null,null,null,null,null,"HSS10X3X1/4",20.687737969784596,null,"W18X143",143]
[null,null,null,null,null,"HSS5-1/2X5-1/2X5/16",21.158811215437474,null,"W14X145",145]
[null,null,null,null,null,"HSS6X5X5/16",21.188320104326365,null,"W24X146",146]
[null,null,null,null,null,"HSS7X4X5/16",21.188320104326365,null,"W27X146",146]
[null,null,null,null,null,"HSS8X3X5/16",21.188320104326365,null,"W21X147",147]
[null,null,null,null,null,"HSS4X4X1/2",21.498316535680594,null,"W30X148",148]
[null,null,null,null,null,"HSS5X3X1/2",21.498316535680594,null,"W40X149",149]
[null,null,null,null,null,"HSS10X3-1/2X1/4",21.538432414229042,null,"W36X150",150]
[null,null,null,null,null,"HSS14X4X3/16",22.118253520796696,null,"W12X152",152]
[null,null,null,null,null,"HSS9X9X3/16",22.163464187463362,null,"W33X152",152]
[null,null,null,null,null,"HSS10X8X3/16",22.2199775207967,null,"W18X158",158]
[null,null,null,null,null,"HSS12X6X3/16",22.2199775207967,null,"W14X159",159]
[null,null,null,null,null,"HSS5X5X3/8",22.301626502748881,null,"W36X160",160]
[null,null,null,null,null,"HSS6X4X3/8",22.301626502748881,null,"W27X161",161]
[null,null,null,null,null,"HSS7X3X3/8",22.301626502748881,null,"W24X162",162]
[null,null,null,null,null,"HSS8X2X3/8",22.301626502748881,null,"W21X166",166]
[null,null,null,null,null,"HSS10X4X1/4",22.389126858673485,null,"W40X167",167]
[null,null,null,null,null,"HSS12X2X1/4",22.389126858673485,null,"W33X169",169]
[null,null,null,null,null,"HSS7X7X1/4",22.389126858673485,null,"W12X170",170]
[null,null,null,null,null,"HSS8X6X1/4",22.389126858673485,null,"W36X170",170]
[null,null,null,null,null,"HSS9X5X1/4",22.389126858673485,null,"W30X173",173]
[null,null,null,null,null,"HSS6X6X5/16",{"$f":"VLOOKUP(F199,StlSects,4)","v":23.285547326548585},null,"W18X175",{"$f":"VLOOKUP(I199,StlSects,4)","v":175}]
[null,null,null,null,null,"HSS10X2X5/16",23.318458993215252,null,"W14X176",176]
[null,null,null,null,null,"HSS7X5X5/16",23.318458993215252,null,"W24X176",176]
[null,null,null,null,null,"HSS8X4X5/16",23.318458993215252,null,"W27X178",178]
[null,null,null,null,null,"HSS9X3X5/16",23.318458993215252,null,"W21X182",182]
[null,null,null,null,null,"HSS10X5X1/4",24.090515747562375,null,"W36X182",182]
[null,null,null,null,null,"HSS12X3X1/4",24.090515747562375,null,"W40X183",183]
[null,null,null,null,null,"HSS14X6X3/16",24.664892409685585,null,"W12X190",190]
[null,null,null,null,null,"HSS16X4X3/16",24.664892409685585,null,"W30X191",191]
[null,null,null,null,null,"HSS10X10X3/16",24.715547520796697,null,"W18x192",192]
[null,null,null,null,null,"HSS12X8X3/16",24.778866409685588,null,"W24X192",192]
[null,null,null,null,null,"HSS5-1/2X5-1/2X3/8",24.853709836082217,null,"W14X193",193]
[null,null,null,null,null,"HSS6X5X3/8",24.853709836082217,null,"W27X194",194]
[null,null,null,null,null,"HSS7X4X3/8",24.853709836082217,null,"W36X194",194]
[null,null,null,null,null,"HSS8X3X3/8",24.853709836082217,null,"W40X199",199]
[null,null,null,null,null,"HSS4-1/2X4-1/2X1/2",24.901094313458373,null,"W21X201",201]
[null,null,null,null,null,"HSS5X4X1/2",24.901094313458373,null,"W33X201",201]
[null,null,null,null,null,"HSS6X3X1/2",24.901094313458373,null,"W24X207",207]
[null,null,null,null,null,"HSS10X3X5/16",25.448597882104142,null,"W12X210",210]
[null,null,null,null,null,"HSS10X6X1/4",25.791904636451264,null,"W36X210",210]
[null,null,null,null,null,"HSS12X4X1/4",25.791904636451264,null,"W14X211",211]
[null,null,null,null,null,"HSS8X8X1/4",25.791904636451264,null,"W18x211",211]
[null,null,null,null,null,"HSS9X7X1/4",25.791904636451264,null,"W30X211",211]
[null,null,null,null,null,"HSS10X3-1/2X5/16",26.513667326548585,null,"W40X211",211]
[null,null,null,null,null,"HSS10X2X3/8",27.405793169415549,null,"W40X215",215]
[null,null,null,null,null,"HSS6X6X3/8",27.405793169415549,null,"W27X217",217]
[null,null,null,null,null,"HSS7X5X3/8",27.405793169415549,null,"W33X221",221]
[null,null,null,null,null,"HSS8X4X3/8",27.405793169415549,null,"W24X229",229]
[null,null,null,null,null,"HSS9X3X3/8",27.405793169415549,null,"W12X230",230]
[null,null,null,null,null,"HSS7X7X5/16",27.53901954877081,null,"W36X231",230]
[null,null,null,null,null,"HSS10X4X5/16",27.578736770993032,null,"W44X230",230]
[null,null,null,null,null,"HSS12X2X5/16",27.578736770993032,null,"W36X232",232]
[null,null,null,null,null,"HSS8X6X5/16",27.578736770993032,null,"W14X233",233]
[null,null,null,null,null,"HSS9X5X5/16",27.578736770993032,null,"W18x234",234]
[null,null,null,null,null,"HSS5X5X1/2",28.303872091236148,null,"W27X235",235]
[null,null,null,null,null,"HSS6X4X1/2",28.303872091236148,null,"W30X235",235]
[null,null,null,null,null,"HSS7X3X1/2",28.303872091236148,null,"W40X235",235]
[null,null,null,null,null,"HSS10X8X1/4",29.194682414229042,null,"W33X241",241]
[null,null,null,null,null,"HSS12X6X1/4",29.194682414229042,null,"W36X247",247]
[null,null,null,null,null,"HSS9X9X1/4",29.194682414229042,null,"W40X249",249]
[null,null,null,null,null,"HSS14X4X1/4",29.249589636451262,null,"W24X250",250]
[null,null,null,null,null,"HSS10X5X5/16",29.708875659881919,null,"W12X252",252]
[null,null,null,null,null,"HSS12X3X5/16",29.708875659881919,null,"W36X256",256]
[null,null,null,null,null,"HSS12X12X3/16",29.819714187463362,null,"W14X257",257]
[null,null,null,null,null,"HSS10X3X3/8",29.957876502748881,null,"W18x258",258]
[null,null,null,null,null,"HSS12X3-1/2X5/16",30.773945104326366,null,"W27X258",258]
[null,null,null,null,null,"HSS10X3-1/2X3/8",31.233918169415549,null,"W30X261",261]
[null,null,null,null,null,"HSS6X5X1/2",31.706649869013926,null,"W36X262",262]
[null,null,null,null,null,"HSS7X4X1/2",31.706649869013926,null,"W44X262",262]
[null,null,null,null,null,"HSS8X3X1/2",31.706649869013926,null,"W33X263",263]
[null,null,null,null,null,"HSS8X8X5/16",31.792491770993031,null,"W40X264",264]
[null,null,null,null,null,"HSS10X6X5/16",31.839014548770809,null,"W40X277",277]
[null,null,null,null,null,"HSS12X4X5/16",31.839014548770809,null,"W40X278",278]
[null,null,null,null,null,"HSS9X7X5/16",31.839014548770809,null,"W12X279",279]
[null,null,null,null,null,"HSS10X4X3/8",32.509959836082217,null,"W24X279",279]
[null,null,null,null,null,"HSS7X7X3/8",32.509959836082217,null,"W27X281",281]
[null,null,null,null,null,"HSS8X6X3/8",32.509959836082217,null,"W36X282",282]
[null,null,null,null,null,"HSS9X5X3/8",32.509959836082217,null,"W14X283",283]
[null,null,null,null,null,"HSS10X10X1/4",32.597460192006821,null,"W18x283",283]
[null,null,null,null,null,"HSS12X8X1/4",32.597460192006821,null,"W44X290",290]
[null,null,null,null,null,"HSS14X6X1/4",32.659172969784599,null,"W33X291",291]
[null,null,null,null,null,"HSS16X4X1/4",32.659172969784599,null,"W30X292",292]
[null,null,null,null,null,"HSS10X5X3/8",35.062043169415546,null,"W40X294",294]
[null,null,null,null,null,"HSS6X6X1/2",35.109427646791701,null,"W40X297",297]
[null,null,null,null,null,"HSS7X5X1/2",{"$f":"VLOOKUP(F263,StlSects,4)","v":35.109427646791701},null,"W36X302",{"$f":"VLOOKUP(I263,StlSects,4)","v":302}]
[null,null,null,null,null,"HSS8X4X1/2",35.109427646791701,null,"W12X305",305]
[null,null,null,null,null,"HSS9X3X1/2",35.109427646791701,null,"W24X306",306]
[null,null,null,null,null,"HSS12X10X1/4",36.0002379697846,null,"W27X307",307]
[null,null,null,null,null,"HSS9X9X5/16",36.045963993215253,null,"W14X311",311]
[null,null,null,null,null,"HSS14X4X5/16",36.088626659881918,null,"W18x311",311]
[null,null,null,null,null,"HSS10X8X5/16",36.099292326548586,null,"W33X318",318]
[null,null,null,null,null,"HSS12X6X5/16",36.099292326548586,null,"W40X324",324]
[null,null,null,null,null,"HSS12X3-1/2X3/8",36.338084836082217,null,"W30X326",326]
[null,null,null,null,null,"HSS10X6X3/8",37.614126502748881,null,"W40X327",327]
[null,null,null,null,null,"HSS12X4X3/8",37.614126502748881,null,"W36X330",330]
[null,null,null,null,null,"HSS8X8X3/8",37.614126502748881,null,"W40X331",331]
[null,null,null,null,null,"HSS9X7X3/8",37.614126502748881,null,"W24X335",335]
[null,null,null,null,null,"HSS12X12X1/4",39.403015747562378,null,"W44X335",335]
[null,null,null,null,null,"HSS14X10X1/4",39.47833963645126,null,"W12X336",336]
[null,null,null,null,null,"HSS16X8X1/4",39.47833963645126,null,"W27X336",336]
[null,null,null,null,null,"HSS18X6X1/4",39.47833963645126,null,"W14X342",342]
[null,null,null,null,null,"HSS20X4X1/4",39.47833963645126,null,"W33X354",354]
[null,null,null,null,null,"HSS10X3-1/2X1/2",40.213594313458373,null,"W30X357",357]
[null,null,null,null,null,"HSS10X10X5/16",40.299436215437474,null,"W36X361",361]
[null,null,null,null,null,"HSS14X6X5/16",40.347543326548589,null,"W40X362",362]
[null,null,null,null,null,"HSS16X4X5/16",40.347543326548589,null,"W27X368",368]
[null,null,null,null,null,"HSS12X8X5/16",40.359570104326366,null,"W14X370",370]
[null,null,null,null,null,"HSS10X4X1/2",41.914983202347258,null,"W24X370",370]
[null,null,null,null,null,"HSS7X7X1/2",41.914983202347258,null,"W40X372",372]
[null,null,null,null,null,"HSS8X6X1/2",41.914983202347258,null,"W33X387",387]
[null,null,null,null,null,"HSS9X5X1/2",41.914983202347258,null,"W30X391",391]
[null,null,null,null,null,"HSS6X6X5/8",42.097252513024195,null,"W40X392",392]
[null,null,null,null,null,"HSS8X4X5/8",42.097252513024195,null,"W36X395",395]
[null,null,null,null,null,"HSS10X8X3/8",42.718293169415546,null,"W40X397",397]
[null,null,null,null,null,"HSS12X6X3/8",42.718293169415546,null,"W14X398",398]
[null,null,null,null,null,"HSS9X9X3/8",42.718293169415546,null,"W14X426",426]
[null,null,null,null,null,"HSS14X4X3/8",42.749342836082214,null,"W40X431",431]
[null,null,null,null,null,"HSS12X10X5/16",44.619847882104139,null,"W36X441",442]
[null,null,null,null,null,"HSS10X10X3/8",47.82245983608221,null,"W14X455",455]
[null,null,null,null,null,"HSS12X8X3/8",47.82245983608221,null,"W36X487",487]
[null,null,null,null,null,"HSS14X6X3/8",47.857592836082212,null,"W14X500",500]
[null,null,null,null,null,"HSS16X4X3/8",47.857592836082212,null,"W40X503",503]
[null,null,null,null,null,"HSS10X6X1/2",48.720538757902816,null,"W36X529",529]
[null,null,null,null,null,"HSS12X4X1/2",48.720538757902816,null,"W27X539",539]
[null,null,null,null,null,"HSS8X8X1/2",48.720538757902816,null,"W14X550",550]
[null,null,null,null,null,"HSS9X7X1/2",48.720538757902816,null,"W40X593",593]
[null,null,null,null,null,"HSS12X12X5/16",48.806380659881917,null,"W14X605",605]
[null,null,null,null,null,"HSS14X10X5/16",48.865376659881925,null,"W36X652",652]
[null,null,null,null,null,"HSS16X8X5/16",48.865376659881925,null,"W14X665",665]
[null,null,null,null,null,"HSS18X6X5/16",48.865376659881925,null,"W14X730",730]
[null,null,null,null,null,"HSS20X4X5/16",48.865376659881925,null,"W36X800",800]
[null,null,null,null,null,"HSS10X4X5/8",50.604196957468638]
[null,null,null,null,null,"HSS7X7X5/8",50.604196957468638]
[null,null,null,null,null,"HSS8X6X5/8",50.604196957468638]
[null,null,null,null,null,"HSS9X5X5/8",50.604196957468638]
[null,null,null,null,null,"HSS12X10X3/8",52.926626502748874]
[null,null,null,null,null,"HSS10X8X1/2",55.52609431345838]
[null,null,null,null,null,"HSS12X6X1/2",55.52609431345838]
[null,null,null,null,null,"HSS14X4X1/2",55.52609431345838]
[null,null,null,null,null,"HSS9X9X1/2",55.52609431345838]
[null,null,null,null,null,"HSS14X14X5/16",57.313325104326367]
[null,null,null,null,null,"HSS20X8X5/16",57.313325104326367]
[null,null,null,null,null,"HSS16X12X5/16",57.38320999321526]
[null,null,null,null,null,"HSS12X12X3/8",58.030793169415539]
[null,null,null,null,null,"HSS14X10X3/8",58.074092836082208]
[null,null,null,null,null,"HSS16X8X3/8",58.074092836082208]
[null,null,null,null,null,"HSS18X6X3/8",58.074092836082208]
[null,null,null,null,null,"HSS20X4X3/8",58.074092836082208]
[null,null,null,null,null,"HSS10X6X5/8",{"$f":"VLOOKUP(F327,StlSects,4)","v":59.111141401913081}]
[null,null,null,null,null,"HSS12X4X5/8",59.111141401913081]
[null,null,null,null,null,"HSS8X8X5/8",59.111141401913081]
[null,null,null,null,null,"HSS9X7X5/8",59.111141401913081]
[null,null,null,null,null,"HSS10X10X1/2",62.33164986901393]
[null,null,null,null,null,"HSS12X8X1/2",62.33164986901393]
[null,null,null,null,null,"HSS14X6X1/2",62.33164986901393]
[null,null,null,null,null,"HSS16X4X1/2",62.33164986901393]
[null,null,null,null,null,"HSS16X16X5/16",65.82026954877081]
[null,null,null,null,null,"HSS20X12X5/16",65.82026954877081]
[null,null,null,null,null,"HSS14X4X5/8",67.5908255130242]
[null,null,null,null,null,"HSS10X8X5/8",67.61808584635753]
[null,null,null,null,null,"HSS12X6X5/8",67.61808584635753]
[null,null,null,null,null,"HSS9X9X5/8",67.61808584635753]
[null,null,null,null,null,"HSS14X14X3/8",68.239126502748874]
[null,null,null,null,null,"HSS16X12X3/8",68.290592836082212]
[null,null,null,null,null,"HSS20X8X3/8",68.290592836082212]
[null,null,null,null,null,"HSS12X10X1/2",69.137205424569487]
[null,null,null,null,null,"HSS12X12X1/2",75.942760980125044]
[null,null,null,null,null,"HSS14X10X1/2",75.942760980125044]
[null,null,null,null,null,"HSS16X8X1/2",75.942760980125044]
[null,null,null,null,null,"HSS18X6X1/2",75.942760980125044]
[null,null,null,null,null,"HSS20X4X1/2",75.942760980125044]
[null,null,null,null,null,"HSS14X6X5/8",76.093686624135302]
[null,null,null,null,null,"HSS16X4X5/8",76.093686624135302]
[null,null,null,null,null,"HSS10X10X5/8",76.125030290801973]
[null,null,null,null,null,"HSS12X8X5/8",76.125030290801973]
[null,null,null,null,null,"HSS16X16X3/8",78.447459836082203]
[null,null,null,null,null,"HSS20X12X3/8",78.447459836082203]
[null,null,null,null,null,"HSS14X14X1/2",89.553872091236158]
[null,null,null,null,null,"HSS16X12X1/2",89.553872091236158]
[null,null,null,null,null,"HSS20X8X1/2",89.553872091236158]
[null,null,null,null,null,"HSS14X10X5/8",93.09940884635752]
[null,null,null,null,null,"HSS16X8X5/8",93.09940884635752]
[null,null,null,null,null,"HSS18X6X5/8",93.09940884635752]
[null,null,null,null,null,"HSS12X12X5/8",93.138919179690859]
[null,null,null,null,null,"HSS16X16X1/2",103]
[null,null,null,null,null,"HSS20X12X1/2",103]
[null,null,null,null,null,"HSS14X14X5/8",110]
[null,null,null,null,null,"HSS16X12X5/8",110]
[null,null,null,null,null,"HSS20X8X5/8",110]
[null,null,null,null,null,"HSS16X16X5/8",127]
[null,null,null,null,null,"HSS20X12X5/8",127]

{"sheet":"StlSects","index":5,"n_rows":893,"n_cols":49,"rows_kept":893,"cut":false,"hidden":false,"merged":[]}
[1,2,3,4,5,6,7,8,9,10,11,12,13,14,15,16,17,18,19,20,21,22,23,24,25,26,27,28,29,30,31,32,33,34,35,36,37,38,39,40,41,42,43,44,45,46,47,48,49]
["AISC_MANUAL_LABEL","TYPE","T_F","W","A","D","HT","OD","BF","B","ID","TW","TF","T","TNOM","TDES","KDES","KDET","K1","X","Y","E0","XP","YP","BF_2TF","B_T","H_TW","H_T","D_T","IX","ZX","SX","RX","IY","ZY","SY","RY","RZ","J","CW","C","WNO","SW","QF","QW","RO","H","TAN_ALPHA","QS"]
["C10X15.3","C","F",15.3,4.4800000000000004,10,0,0,2.6,0,0,0.24,0.436,0,0,0,1,1,0,0.63400000000000001,0,0.79600000000000004,0.224,0,0,0,0,0,0,67.3,15.9,13.5,3.87,2.27,2.34,1.1499999999999999,0.71099999999999997,0,0.20899999999999999,45.5,0,0,0,0,0,4.1900000000000004,0.88400000000000001,0,0]
["C10X20","C","F",20,5.87,10,0,0,2.74,0,0,0.379,0.436,0,0,0,1,1,0,0.60599999999999998,0,0.63600000000000001,0.29399999999999998,0,0,0,0,0,0,78.900000000000006,19.399999999999999,15.8,3.66,2.8,2.7,1.31,0.69,0,0.36799999999999999,56.9,0,0,0,0,0,3.93,0.9,0,0]
["C10X25","C","F",25,7.34,10,0,0,2.89,0,0,0.52600000000000002,0.436,0,0,0,1,1,0,0.61699999999999999,0,0.49399999999999999,0.36699999999999999,0,0,0,0,0,0,91.1,23.1,18.2,3.52,3.34,3.18,1.47,0.67500000000000004,0,0.68700000000000006,68.3,0,0,0,0,0,3.76,0.91200000000000003,0,0]
["C10X30","C","F",30,8.81,10,0,0,3.03,0,0,0.67300000000000004,0.436,0,0,0,1,1,0,0.64900000000000002,0,0.36799999999999999,0.441,0,0,0,0,0,0,103,26.7,20.7,3.42,3.93,3.78,1.65,0.66800000000000004,0,1.22,79.5,0,0,0,0,0,3.63,0.92100000000000004,0,0]
["C12X20.7","C","F",20.7,6.08,12,0,0,2.94,0,0,0.28199999999999997,0.501,0,0,0,1.1299999999999999,1.125,0,0.69799999999999995,0,0.87,0.253,0,0,0,0,0,0,129,25.6,21.5,4.6100000000000003,3.86,3.47,1.72,0.79700000000000004,0,0.36899999999999999,112,0,0,0,0,0,4.93,0.89900000000000002,0,0]
["C12X25","C","F",25,7.34,12,0,0,3.05,0,0,0.38700000000000001,0.501,0,0,0,1.1299999999999999,1.125,0,0.67400000000000004,0,0.746,0.30599999999999999,0,0,0,0,0,0,144,29.4,24,4.43,4.45,3.82,1.87,0.77900000000000003,0,0.53800000000000003,130,0,0,0,0,0,4.72,0.90900000000000003,0,0]
["C12X30","C","F",30,8.81,12,0,0,3.17,0,0,0.51,0.501,0,0,0,1.1299999999999999,1.125,0,0.67400000000000004,0,0.61799999999999999,0.36699999999999999,0,0,0,0,0,0,162,33.799999999999997,27,4.29,5.12,4.32,2.0499999999999998,0.76200000000000001,0,0.86099999999999999,151,0,0,0,0,0,4.54,0.91900000000000004,0,0]
["C15X33.9","C","F",33.9,10,15,0,0,3.4,0,0,0.4,0.65,0,0,0,1.44,1.4375,0,0.78800000000000003,0,0.89600000000000002,0.33200000000000002,0,0,0,0,0,0,315,50.8,42,5.62,8.07,6.19,3.09,0.90100000000000002,0,1.01,358,0,0,0,0,0,5.94,0.92,0,0]
["C15X40","C","F",40,11.8,15,0,0,3.52,0,0,0.52,0.65,0,0,0,1.44,1.4375,0,0.77800000000000002,0,0.76700000000000002,0.39200000000000002,0,0,0,0,0,0,348,57.5,46.5,5.45,9.17,6.84,3.34,0.88300000000000001,0,1.45,410,0,0,0,0,0,5.71,0.92700000000000005,0,0]
["C15X50","C","F",50,14.7,15,0,0,3.72,0,0,0.71599999999999997,0.65,0,0,0,1.44,1.4375,0,0.79900000000000004,0,0.58299999999999996,0.49,0,0,0,0,0,0,404,68.5,53.8,5.24,11,8.14,3.77,0.86499999999999999,0,2.65,492,0,0,0,0,0,5.49,0.93700000000000006,0,0]
["C3X3.5","C","F",3.5,1.0900000000000001,3,0,0,1.37,0,0,0.13200000000000001,0.27300000000000002,0,0,0,0.68799999999999994,0.6875,0,0.443,0,0.49299999999999999,0.29599999999999999,0,0,0,0,0,0,1.57,1.24,1.04,1.2,0.16900000000000001,0.36399999999999999,0.182,0.39400000000000002,0,2.2599999999999999E-2,0.27600000000000002,0,0,0,0,0,1.57,0.64600000000000002,0,0]
["C3X4.1","C","F",4.0999999999999996,1.2,3,0,0,1.41,0,0,0.17,0.27300000000000002,0,0,0,0.68799999999999994,0.6875,0,0.437,0,0.46100000000000002,0.26200000000000001,0,0,0,0,0,0,1.65,1.32,1.1000000000000001,1.17,0.191,0.39900000000000002,0.19600000000000001,0.39800000000000002,0,2.69E-2,0.307,0,0,0,0,0,1.53,0.65500000000000003,0,0]
["C3X5","C","F",5,1.47,3,0,0,1.5,0,0,0.25800000000000001,0.27300000000000002,0,0,0,0.68799999999999994,0.6875,0,0.439,0,0.39200000000000002,0.245,0,0,0,0,0,0,1.85,1.52,1.23,1.1200000000000001,0.24099999999999999,0.46400000000000002,0.22800000000000001,0.40500000000000003,0,4.2500000000000003E-2,0.379,0,0,0,0,0,1.45,0.67300000000000004,0,0]
["C3X6","C","F",6,1.76,3,0,0,1.6,0,0,0.35599999999999998,0.27300000000000002,0,0,0,0.68799999999999994,0.6875,0,0.45500000000000002,0,0.32200000000000001,0.29399999999999998,0,0,0,0,0,0,2.0699999999999998,1.74,1.38,1.08,0.3,0.54300000000000004,0.26300000000000001,0.41299999999999998,0,7.2499999999999995E-2,0.46200000000000002,0,0,0,0,0,1.4,0.69,0,0]
["C4X4.5","C","F",4.5,1.38,4,0,0,1.58,0,0,0.125,0.29599999999999999,0,0,0,0.75,0.75,0,0.49299999999999999,0,0.58699999999999997,0.32100000000000001,0,0,0,0,0,0,3.65,2.12,1.83,1.63,0.28899999999999998,0.53100000000000003,0.26500000000000001,0.45700000000000002,0,3.2199999999999999E-2,0.871,0,0,0,0,0,2.0099999999999998,0.71,0,0]
["C4X5.4","C","F",5.4,1.58,4,0,0,1.58,0,0,0.184,0.29599999999999999,0,0,0,0.75,0.75,0,0.45700000000000002,0,0.501,0.23100000000000001,0,0,0,0,0,0,3.85,2.29,1.92,1.56,0.312,0.56499999999999995,0.27700000000000002,0.44400000000000001,0,3.9899999999999998E-2,0.92100000000000004,0,0,0,0,0,1.88,0.74199999999999999,0,0]
["C4X7.2","C","F",7.2,2.13,4,0,0,1.72,0,0,0.32100000000000001,0.29599999999999999,0,0,0,0.75,0.75,0,0.45900000000000002,0,0.38600000000000001,0.26600000000000001,0,0,0,0,0,0,4.58,2.84,2.29,1.47,0.42499999999999999,0.69499999999999995,0.33700000000000002,0.44700000000000001,0,8.1699999999999995E-2,1.24,0,0,0,0,0,1.75,0.76700000000000002,0,0]
["C5X6.7","C","F",6.7,1.97,5,0,0,1.75,0,0,0.19,0.32,0,0,0,0.75,0.75,0,0.48399999999999999,0,0.55200000000000005,0.215,0,0,0,0,0,0,7.48,3.55,2.99,1.95,0.47,0.75700000000000001,0.372,0.48899999999999999,0,5.4899999999999997E-2,2.2200000000000002,0,0,0,0,0,2.2599999999999998,0.79,0,0]
["C5X9","C","F",9,2.64,5,0,0,1.89,0,0,0.32500000000000001,0.32,0,0,0,0.75,0.75,0,0.47799999999999998,0,0.42699999999999999,0.26400000000000001,0,0,0,0,0,0,8.89,4.3899999999999997,3.56,1.83,0.624,0.91300000000000003,0.44400000000000001,0.48599999999999999,0,0.109,2.93,0,0,0,0,0,2.1,0.81499999999999995,0,0]
["C6X10.5","C","F",10.5,3.08,6,0,0,2.0299999999999998,0,0,0.314,0.34300000000000003,0,0,0,0.81299999999999994,0.8125,0,0.5,0,0.48599999999999999,0.25600000000000001,0,0,0,0,0,0,15.1,6.18,5.04,2.2200000000000002,0.86,1.1399999999999999,0.56100000000000005,0.52900000000000003,0,0.128,5.91,0,0,0,0,0,2.48,0.84199999999999997,0,0]
["C6X13","C","F",13,3.81,6,0,0,2.16,0,0,0.437,0.34300000000000003,0,0,0,0.81299999999999994,0.8125,0,0.51400000000000001,0,0.38,0.318,0,0,0,0,0,0,17.3,7.29,5.78,2.13,1.05,1.35,0.63800000000000001,0.52400000000000002,0,0.23699999999999999,7.19,0,0,0,0,0,2.37,0.85799999999999998,0,0]
["C6X8.2","C","F",8.1999999999999993,2.39,6,0,0,1.92,0,0,0.2,0.34300000000000003,0,0,0,0.81299999999999994,0.8125,0,0.51200000000000001,0,0.59899999999999998,0.19900000000000001,0,0,0,0,0,0,13.1,5.16,4.3499999999999996,2.34,0.68700000000000006,0.98699999999999999,0.48799999999999999,0.53600000000000003,0,7.3599999999999999E-2,4.7,0,0,0,0,0,2.65,0.82399999999999995,0,0]
["C7X12.2","C","F",12.2,3.6,7,0,0,2.19,0,0,0.314,0.36599999999999999,0,0,0,0.875,0.875,0,0.52500000000000002,0,0.53800000000000003,0.25700000000000001,0,0,0,0,0,0,24.2,8.4600000000000009,6.92,2.6,1.1599999999999999,1.42,0.69599999999999995,0.56799999999999995,0,0.161,11.2,0,0,0,0,0,2.86,0.86199999999999999,0,0]
["C7X14.7","C","F",14.7,4.33,7,0,0,2.2999999999999998,0,0,0.41899999999999998,0.36599999999999999,0,0,0,0.875,0.875,0,0.53200000000000003,0,0.441,0.309,0,0,0,0,0,0,27.2,9.75,7.78,2.5099999999999998,1.37,1.63,0.77200000000000002,0.56100000000000005,0,0.26700000000000002,13.1,0,0,0,0,0,2.75,0.875,0,0]
["C7X9.8","C","F",9.8000000000000007,2.87,7,0,0,2.09,0,0,0.21,0.36599999999999999,0,0,0,0.875,0.875,0,0.54100000000000004,0,0.64700000000000002,0.20499999999999999,0,0,0,0,0,0,21.2,7.19,6.07,2.72,0.95699999999999996,1.26,0.61699999999999999,0.57799999999999996,0,9.9599999999999994E-2,9.15,0,0,0,0,0,3.02,0.84499999999999997,0,0]
["C8X11.5","C","F",11.5,3.37,8,0,0,2.2599999999999998,0,0,0.22,0.39,0,0,0,0.93799999999999994,0.9375,0,0.57199999999999995,0,0.69699999999999995,0.21099999999999999,0,0,0,0,0,0,32.5,9.6300000000000008,8.14,3.11,1.31,1.57,0.77500000000000002,0.623,0,0.13,16.5,0,0,0,0,0,3.41,0.86199999999999999,0,0]
["C8X13.7","C","F",13.7,4.04,8,0,0,2.34,0,0,0.30299999999999999,0.39,0,0,0,0.93799999999999994,0.9375,0,0.55400000000000005,0,0.60399999999999998,0.252,0,0,0,0,0,0,36.1,11,9.02,2.99,1.52,1.73,0.84799999999999998,0.61299999999999999,0,0.186,19.2,0,0,0,0,0,3.26,0.874,0,0]
["C8X18.7","C","F",18.7,5.51,8,0,0,2.5299999999999998,0,0,0.48699999999999999,0.39,0,0,0,0.93799999999999994,0.9375,0,0.56499999999999995,0,0.43099999999999999,0.34399999999999997,0,0,0,0,0,0,43.9,13.9,11,2.82,1.97,2.17,1.01,0.59799999999999998,0,0.434,25.1,0,0,0,0,0,3.05,0.89400000000000002,0,0]
["C9X13.4","C","F",13.4,3.94,9,0,0,2.4300000000000002,0,0,0.23300000000000001,0.41299999999999998,0,0,0,1,1,0,0.60099999999999998,0,0.74199999999999999,0.219,0,0,0,0,0,0,47.8,12.6,10.6,3.49,1.75,1.94,0.95399999999999996,0.66600000000000004,0,0.16800000000000001,28.2,0,0,0,0,0,3.79,0.875,0,0]
["C9X15","C","F",15,4.41,9,0,0,2.4900000000000002,0,0,0.28499999999999998,0.41299999999999998,0,0,0,1,1,0,0.58599999999999997,0,0.68100000000000005,0.245,0,0,0,0,0,0,51,13.6,11.3,3.4,1.91,2.04,1.01,0.65900000000000003,0,0.20799999999999999,31,0,0,0,0,0,3.69,0.88200000000000001,0,0]
["C9X20","C","F",20,5.87,9,0,0,2.65,0,0,0.44800000000000001,0.41299999999999998,0,0,0,1,1,0,0.58299999999999996,0,0.51500000000000001,0.32600000000000001,0,0,0,0,0,0,60.9,16.899999999999999,13.5,3.22,2.41,2.46,1.17,0.64,0,0.42699999999999999,39.4,0,0,0,0,0,3.46,0.89900000000000002,0,0]
["HP10X42","HP","F",42,12.4,9.6999999999999993,0,0,10.1,0,0,0.41499999999999998,0.42,0,0,0,1.1299999999999999,1.125,0.8125,0,0,0,0,0,12,0,18.899999999999999,0,0,210,48.3,43.4,4.13,71.7,21.8,14.2,2.41,0,0.81299999999999994,1540,0,23.4,24.7,9.41,23.7,0,0,0,0]
["HP10X57","HP","F",57,16.8,10,0,0,10.199999999999999,0,0,0.56499999999999995,0.56499999999999995,0,0,0,1.25,1.25,0.9375,0,0,0,0,0,9.0500000000000007,0,13.9,0,0,294,66.5,58.8,4.18,101,30.3,19.7,2.4500000000000002,0,1.97,2240,0,24.1,34.799999999999997,12.9,32.799999999999997,0,0,0,0]
["HP12X53","HP","F",53,15.5,11.8,0,0,12,0,0,0.435,0.435,0,0,0,1.1299999999999999,1.125,0.875,0,0,0,0,0,13.8,0,22.3,0,0,393,74,66.7,5.03,127,32.200000000000003,21.1,2.86,0,1.1200000000000001,4080,0,34.200000000000003,44.7,14.3,36.200000000000003,0,0,0,0]
["HP12X63","HP","F",63,18.399999999999999,11.9,0,0,12.1,0,0,0.51500000000000001,0.51500000000000001,0,0,0,1.25,1.25,0.875,0,0,0,0,0,11.8,0,18.899999999999999,0,0,472,88.3,79.099999999999994,5.0599999999999996,153,38.700000000000003,25.3,2.88,0,1.83,5000,0,34.6,54.1,17.100000000000001,43.3,0,0,0,0]
["HP12X74","HP","F",74,21.8,12.1,0,0,12.2,0,0,0.60499999999999998,0.61,0,0,0,1.31,1.3125,0.9375,0,0,0,0,0,10,0,16.100000000000001,0,0,569,105,93.8,5.1100000000000003,186,46.6,30.4,2.92,0,2.98,6160,0,35.200000000000003,65.5,20.399999999999999,51.9,0,0,0,0]
["HP12X84","HP","F",84,24.6,12.3,0,0,12.3,0,0,0.68500000000000005,0.68500000000000005,0,0,0,1.38,1.375,1,0,0,0,0,0,8.9700000000000006,0,14.2,0,0,650,120,106,5.14,213,53.2,34.6,2.94,0,4.24,7140,0,35.6,75,23.1,59,0,0,0,0]
["HP14X102","HP","F",102,30,14,0,0,14.8,0,0,0.70499999999999996,0.70499999999999996,0,0,0,1.38,1.375,1,0,0,0,0,0,10.5,0,16.2,0,0,1050,169,150,5.92,380,78.8,51.4,3.56,0,5.39,16800,0,49.2,128,33,83.3,0,0,0,0]
["HP14X117","HP","F",117,34.4,14.2,0,0,14.9,0,0,0.80500000000000005,0.80500000000000005,0,0,0,1.5,1.5,1.0625,0,0,0,0,0,9.25,0,14.2,0,0,1220,194,172,5.96,443,91.4,59.5,3.59,0,8.02,19900,0,49.9,149,38,96.3,0,0,0,0]
["HP14X73","HP","F",73,21.4,13.6,0,0,14.6,0,0,0.505,0.505,0,0,0,1.19,1.1875,0.875,0,0,0,0,0,14.4,0,22.6,0,0,729,118,107,5.84,261,54.6,35.799999999999997,3.49,0,2.0099999999999998,11200,0,47.8,88,23.3,58.3,0,0,0,0]
["HP14X89","HP","F",89,26.1,13.8,0,0,14.7,0,0,0.61499999999999999,0.61499999999999999,0,0,0,1.31,1.3125,0.9375,0,0,0,0,0,11.9,0,18.5,0,0,904,146,131,5.88,326,67.7,44.3,3.53,0,3.59,14200,0,48.5,110,28.6,71.900000000000006,0,0,0,0]
["HP8X36","HP","F",36,10.6,8.02,0,0,8.16,0,0,0.44500000000000001,0.44500000000000001,0,0,0,1.1299999999999999,1.125,0.875,0,0,0,0,0,9.16,0,14.2,0,0,119,33.6,29.8,3.36,40.299999999999997,15.2,9.8800000000000008,1.95,0,0.77,578,0,15.4,14,6.5,16.600000000000001,0,0,0,0]
["HSS1.660X0.140","HSS","F",2.2748621470494093,0.625,0,0,1.66,0,0,0,0,0,0,0.14000000000000001,0.13,0,0,0,0,0,0,0,0,0,0,0,0,12.8,0.184,0.30499999999999999,0.222,0.54300000000000004,0.184,0.30499999999999999,0.222,0.54300000000000004,0,0.36799999999999999,0,0.44400000000000001,0,0,0,0,0,0,0,0]
["HSS1.900X0.120","HSS","F",2.2834142603841814,0.624,0,0,1.9,0,0,0,0,0,0,0.12,0.111,0,0,0,0,0,0,0,0,0,0,0,0,17.100000000000001,0.251,0.35599999999999998,0.26400000000000001,0.63400000000000001,0.251,0.35599999999999998,0.26400000000000001,0.63400000000000001,0,0.501,0,0.52700000000000002,0,0,0,0,0,0,0,0]
["HSS1.900X0.145","HSS","F",2.7203738010827001,0.749,0,0,1.9,0,0,0,0,0,0,0.14499999999999999,0.13500000000000001,0,0,0,0,0,0,0,0,0,0,0,0,14.1,0.29299999999999998,0.42099999999999999,0.309,0.626,0.29299999999999998,0.42099999999999999,0.309,0.626,0,0.58599999999999997,0,0.61699999999999999,0,0,0,0,0,0,0,0]
["HSS1.900X0.188","HSS","F",3.4406862368455564,0.94299999999999995,0,0,1.9,0,0,0,0,0,0,0.1875,0.17399999999999999,0,0,0,0,0,0,0,0,0,0,0,0,10.9,0.35499999999999998,0.52,0.374,0.61299999999999999,0.35499999999999998,0.52,0.374,0.61299999999999999,0,0.71,0,0.747,0,0,0,0,0,0,0,0]
["HSS10.750X0.250","HSS","F",28.061621879721329,7.7,0,0,10.75,0,0,0,0,0,0,0.25,0.23300000000000001,0,0,0,0,0,0,0,0,0,0,0,0,46.1,106,25.8,19.8,3.72,106,25.8,19.8,3.72,0,213,0,39.6,0,0,0,0,0,0,0,0]
["HSS10.750X0.375","HSS","F",41.591332428872683,11.4,0,0,10.75,0,0,0,0,0,0,0.375,0.34899999999999998,0,0,0,0,0,0,0,0,0,0,0,0,30.8,154,37.799999999999997,28.7,3.68,154,37.799999999999997,28.7,3.68,0,309,0,57.4,0,0,0,0,0,0,0,0]
["HSS10.750X0.500","HSS","F",54.786976050884491,15,0,0,10.75,0,0,0,0,0,0,0.5,0.46500000000000002,0,0,0,0,0,0,0,0,0,0,0,0,23.1,199,49.2,37,3.64,199,49.2,37,3.64,0,398,0,74.099999999999994,0,0,0,0,0,0,0,0]
["HSS10X0.188","HSS","F",19.719633969584432,5.37,0,0,10,0,0,0,0,0,0,0.1875,0.17399999999999999,0,0,0,0,0,0,0,0,0,0,0,0,57.5,64.8,16.8,13,3.47,64.8,16.8,13,3.47,0,130,0,25.9,0,0,0,0,0,0,0,0]
["HSS10X0.250","HSS","F",26.057220316884091,7.15,0,0,10,0,0,0,0,0,0,0.25,0.23300000000000001,0,0,0,0,0,0,0,0,0,0,0,0,42.9,85.3,22.2,17.100000000000001,3.45,85.3,22.2,17.100000000000001,3.45,0,171,0,34.1,0,0,0,0,0,0,0,0]
["HSS10X0.312","HSS","F",32.312620855036563,8.8800000000000008,0,0,10,0,0,0,0,0,0,0.3125,0.29099999999999998,0,0,0,0,0,0,0,0,0,0,0,0,34.4,105,27.4,20.9,3.43,105,27.4,20.9,3.43,0,209,0,41.9,0,0,0,0,0,0,0,0]
["HSS10X0.375","HSS","F",38.58473008461683,10.6,0,0,10,0,0,0,0,0,0,0.375,0.34899999999999998,0,0,0,0,0,0,0,0,0,0,0,0,28.7,123,32.5,24.7,3.41,123,32.5,24.7,3.41,0,247,0,49.3,0,0,0,0,0,0,0,0]
["HSS10X0.500","HSS","F",50.778172925210022,13.9,0,0,10,0,0,0,0,0,0,0.5,0.46500000000000002,0,0,0,0,0,0,0,0,0,0,0,0,21.5,159,42.3,31.7,3.38,159,42.3,31.7,3.38,0,317,0,63.5,0,0,0,0,0,0,0,0]
["HSS10X0.625","HSS","F",62.637548838663676,17.2,0,0,10,0,0,0,0,0,0,0.625,0.58099999999999996,0,0,0,0,0,0,0,0,0,0,0,0,17.2,191,51.6,38.299999999999997,3.34,191,51.6,38.299999999999997,3.34,0,383,0,76.599999999999994,0,0,0,0,0,0,0,0]
["HSS10X10X1/2","HSS","F",62.33164986901393,17.2,0,10,0,0,10,0,0,0,0,0.5,0.46500000000000002,0,0,0,0,0,0,0,0,0,18.5,0,18.5,0,256,60.7,51.2,3.86,0,0,0,0,0,412,0,84.2,0,0,0,0,0,0,0,0]
["HSS10X10X1/4","HSS","F",32.597460192006821,8.9600000000000009,0,10,0,0,10,0,0,0,0,0.25,0.23300000000000001,0,0,0,0,0,0,0,0,0,39.9,0,39.9,0,141,32.700000000000003,28.3,3.97,0,0,0,0,0,220,0,44.4,0,0,0,0,0,0,0,0]
["HSS10X10X3/16","HSS","F",24.715547520796697,6.76,0,10,0,0,10,0,0,0,0,0.1875,0.17399999999999999,0,0,0,0,0,0,0,0,0,54.5,0,54.5,0,108,24.8,21.6,4,0,0,0,0,0,167,0,33.6,0,0,0,0,0,0,0,0]
["HSS10X10X3/8","HSS","F",47.82245983608221,13.2,0,10,0,0,10,0,0,0,0,0.375,0.34899999999999998,0,0,0,0,0,0,0,0,0,25.7,0,25.7,0,202,47.2,40.4,3.92,0,0,0,0,0,320,0,64.8,0,0,0,0,0,0,0,0]
["HSS10X10X5/16","HSS","F",40.299436215437474,11.1,0,10,0,0,10,0,0,0,0,0.3125,0.29099999999999998,0,0,0,0,0,0,0,0,0,31.4,0,31.4,0,172,40.1,34.5,3.94,0,0,0,0,0,271,0,54.8,0,0,0,0,0,0,0,0]
["HSS10X10X5/8","HSS","F",76.125030290801973,21,0,10,0,0,10,0,0,0,0,0.625,0.58099999999999996,0,0,0,0,0,0,0,0,0,14.2,0,14.2,0,304,73.2,60.8,3.8,0,0,0,0,0,498,0,102,0,0,0,0,0,0,0,0]
["HSS10X2X1/4","HSS","F",18.98634908089571,5.24,0,10,0,0,2,0,0,0,0,0.25,0.23300000000000001,0,0,0,0,0,0,0,0,0,5.58,0,39.9,0,52.5,14.4,10.5,3.17,3.67,4.26,3.67,0.83799999999999997,0,12.2,0.25,7.99,0,0,0,0,0,0,0,0]
["HSS10X2X1/8","HSS","F",9.850428527761494,2.7,0,10,0,0,2,0,0,0,0,0.125,0.11600000000000001,0,0,0,0,0,0,0,0,0,14.2,0,83.2,0,28.5,7.65,5.7,3.25,2.14,2.33,2.14,0.89,0,6.9,0.125,4.3099999999999996,0,0,0,0,0,0,0,0]
["HSS10X2X3/16","HSS","F",14.543310854130031,3.98,0,10,0,0,2,0,0,0,0,0.1875,0.17399999999999999,0,0,0,0,0,0,0,0,0,8.49,0,54.5,0,41,11.1,8.19,3.21,2.97,3.34,2.97,0.86399999999999999,0,9.74,0.1875,6.22,0,0,0,0,0,0,0,0]
["HSS10X2X3/8","HSS","F",27.405793169415549,7.58,0,10,0,0,2,0,0,0,0,0.375,0.34899999999999998,0,0,0,0,0,0,0,0,0,2.73,0,25.7,0,71.7,20.3,14.3,3.08,4.7,5.76,4.7,0.78700000000000003,0,15.9,0.375,11,0,0,0,0,0,0,0,0]
["HSS10X2X5/16","HSS","F",23.318458993215252,6.43,0,10,0,0,2,0,0,0,0,0.3125,0.29099999999999998,0,0,0,0,0,0,0,0,0,3.87,0,31.4,0,62.6,17.5,12.5,3.12,4.24,5.0599999999999996,4.24,0.81200000000000006,0,14.2,0.3125,9.56,0,0,0,0,0,0,0,0]
["HSS10X3-1/2X1/2","HSS","F",40.213594313458373,11.1,0,10,0,0,3.5,0,0,0,0,0.5,0.46500000000000002,0,0,0,0,0,0,0,0,0,4.53,0,18.5,0,118,31.9,23.7,3.26,21.4,14.7,12.2,1.39,0,63.2,0.5,26.5,0,0,0,0,0,0,0,0]
["HSS10X3-1/2X1/4","HSS","F",21.538432414229042,5.93,0,10,0,0,3.5,0,0,0,0,0.25,0.23300000000000001,0,0,0,0,0,0,0,0,0,12,0,39.9,0,69.099999999999994,17.899999999999999,13.8,3.41,13.1,8.4499999999999993,7.51,1.49,0,37,0.25,14.8,0,0,0,0,0,0,0,0]
["HSS10X3-1/2X1/8","HSS","F",11.12647019442816,3.04,0,10,0,0,3.5,0,0,0,0,0.125,0.11600000000000001,0,0,0,0,0,0,0,0,0,27.2,0,83.2,0,37,9.3699999999999992,7.4,3.49,7.22,4.4800000000000004,4.12,1.54,0,19.8,0.125,7.75,0,0,0,0,0,0,0,0]
["HSS10X3-1/2X3/16","HSS","F",16.4624775207967,4.5,0,10,0,0,3.5,0,0,0,0,0.1875,0.17399999999999999,0,0,0,0,0,0,0,0,0,17.100000000000001,0,54.5,0,53.6,13.7,10.7,3.45,10.3,6.52,5.89,1.51,0,28.6,0.1875,11.4,0,0,0,0,0,0,0,0]
["HSS10X3-1/2X3/8","HSS","F",31.233918169415549,8.6199999999999992,0,10,0,0,3.5,0,0,0,0,0.375,0.34899999999999998,0,0,0,0,0,0,0,0,0,7.03,0,25.7,0,96.1,25.3,19.2,3.34,17.8,11.8,10.199999999999999,1.44,0,51.5,0.375,21.1,0,0,0,0,0,0,0,0]
["HSS10X3-1/2X5/16","HSS","F",26.513667326548585,7.3,0,10,0,0,3.5,0,0,0,0,0.3125,0.29099999999999998,0,0,0,0,0,0,0,0,0,9.0299999999999994,0,31.4,0,83.2,21.7,16.600000000000001,3.38,15.6,10.199999999999999,8.92,1.46,0,44.6,0.3125,18,0,0,0,0,0,0,0,0]
["HSS10X3X1/4","HSS","F",20.687737969784596,5.7,0,10,0,0,3,0,0,0,0,0.25,0.23300000000000001,0,0,0,0,0,0,0,0,0,9.8800000000000008,0,39.9,0,63.6,16.7,12.7,3.34,9.2799999999999994,6.99,6.19,1.28,0,27.6,0.25,12.5,0,0,0,0,0,0,0,0]
["HSS10X3X1/8","HSS","F",10.701122972205939,2.93,0,10,0,0,3,0,0,0,0,0.125,0.11600000000000001,0,0,0,0,0,0,0,0,0,22.9,0,83.2,0,34.200000000000003,8.8000000000000007,6.83,3.42,5.16,3.74,3.44,1.33,0,14.9,0.125,6.61,0,0,0,0,0,0,0,0]
["HSS10X3X3/16","HSS","F",15.822755298574476,4.32,0,10,0,0,3,0,0,0,0,0.1875,0.17399999999999999,0,0,0,0,0,0,0,0,0,14.2,0,54.5,0,49.4,12.8,9.8699999999999992,3.38,7.33,5.41,4.8899999999999997,1.3,0,21.5,0.1875,9.64,0,0,0,0,0,0,0,0]
["HSS10X3X3/8","HSS","F",29.957876502748881,8.27,0,10,0,0,3,0,0,0,0,0.375,0.34899999999999998,0,0,0,0,0,0,0,0,0,5.6,0,25.7,0,88,23.7,17.600000000000001,3.26,12.4,9.73,8.2799999999999994,1.22,0,37.799999999999997,0.375,17.7,0,0,0,0,0,0,0,0]
["HSS10X3X5/16","HSS","F",25.448597882104142,7.01,0,10,0,0,3,0,0,0,0,0.3125,0.29099999999999998,0,0,0,0,0,0,0,0,0,7.31,0,31.4,0,76.3,20.3,15.3,3.3,11,8.42,7.3,1.25,0,33,0.3125,15.2,0,0,0,0,0,0,0,0]
["HSS10X4X1/2","HSS","F",41.914983202347258,11.6,0,10,0,0,4,0,0,0,0,0.5,0.46500000000000002,0,0,0,0,0,0,0,0,0,5.6,0,18.5,0,129,34.1,25.8,3.34,29.5,17.600000000000001,14.7,1.59,0,82.6,0.5,31,0,0,0,0,0,0,0,0]
["HSS10X4X1/4","HSS","F",22.389126858673485,6.17,0,10,0,0,4,0,0,0,0,0.25,0.23300000000000001,0,0,0,0,0,0,0,0,0,14.2,0,39.9,0,74.7,19,14.9,3.48,17.7,10,8.8699999999999992,1.7,0,47.4,0.25,17.100000000000001,0,0,0,0,0,0,0,0]
["HSS10X4X1/8","HSS","F",11.551817416650383,3.16,0,10,0,0,4,0,0,0,0,0.125,0.11600000000000001,0,0,0,0,0,0,0,0,0,31.5,0,83.2,0,39.799999999999997,10,7.97,3.55,9.65,5.26,4.83,1.75,0,25.1,0.125,8.9,0,0,0,0,0,0,0,0]
["HSS10X4X3/16","HSS","F",17.102199743018918,4.67,0,10,0,0,4,0,0,0,0,0.1875,0.17399999999999999,0,0,0,0,0,0,0,0,0,20,0,54.5,0,57.8,14.6,11.6,3.52,13.9,7.66,6.93,1.72,0,36.5,0.1875,13.1,0,0,0,0,0,0,0,0]
["HSS10X4X3/8","HSS","F",32.509959836082217,8.9700000000000006,0,10,0,0,4,0,0,0,0,0.375,0.34899999999999998,0,0,0,0,0,0,0,0,0,8.4600000000000009,0,25.7,0,104,27,20.8,3.41,24.3,14,12.1,1.64,0,66.5,0.375,24.4,0,0,0,0,0,0,0,0]
["HSS10X4X5/16","HSS","F",27.578736770993032,7.59,0,10,0,0,4,0,0,0,0,0.3125,0.29099999999999998,0,0,0,0,0,0,0,0,0,10.7,0,31.4,0,90.1,23.1,18,3.44,21.2,12.1,10.6,1.67,0,57.3,0.3125,20.9,0,0,0,0,0,0,0,0]
["HSS10X4X5/8","HSS","F",50.604196957468638,14,0,10,0,0,4,0,0,0,0,0.625,0.58099999999999996,0,0,0,0,0,0,0,0,0,3.88,0,14.2,0,149,40.299999999999997,29.9,3.26,33.5,20.6,16.8,1.54,0,95.7,0.625,36.700000000000003,0,0,0,0,0,0,0,0]
["HSS10X5X1/4","HSS","F",24.090515747562375,6.63,0,10,0,0,5,0,0,0,0,0.25,0.23300000000000001,0,0,0,0,0,0,0,0,0,18.5,0,39.9,0,85.8,21.3,17.2,3.6,29.3,13.2,11.7,2.1,0,70.7,0.25,21.6,0,0,0,0,0,0,0,0]
["HSS10X5X3/16","HSS","F",18.381644187463365,5.0199999999999996,0,10,0,0,5,0,0,0,0,0.1875,0.17399999999999999,0,0,0,0,0,0,0,0,0,25.7,0,54.5,0,66.2,16.3,13.2,3.63,22.7,10.1,9.09,2.13,0,54.1,0.1875,16.5,0,0,0,0,0,0,0,0]
["HSS10X5X3/8","HSS","F",35.062043169415546,9.67,0,10,0,0,5,0,0,0,0,0.375,0.34899999999999998,0,0,0,0,0,0,0,0,0,11.3,0,25.7,0,120,30.4,24.1,3.53,40.6,18.7,16.2,2.0499999999999998,0,100,0.375,31.2,0,0,0,0,0,0,0,0]
["HSS10X5X5/16","HSS","F",29.708875659881919,8.17,0,10,0,0,5,0,0,0,0,0.3125,0.29099999999999998,0,0,0,0,0,0,0,0,0,14.2,0,31.4,0,104,26,20.8,3.56,35.200000000000003,16,14.1,2.0699999999999998,0,86,0.3125,26.5,0,0,0,0,0,0,0,0]
["HSS10X6X1/2","HSS","F",48.720538757902816,13.5,0,10,0,0,6,0,0,0,0,0.5,0.46500000000000002,0,0,0,0,0,0,0,0,0,9.9,0,18.5,0,171,43,34.299999999999997,3.57,76.8,30.1,25.6,2.39,0,176,0.5,48.7,0,0,0,0,0,0,0,0]
["HSS10X6X1/4","HSS","F",25.791904636451264,7.1,0,10,0,0,6,0,0,0,0,0.25,0.23300000000000001,0,0,0,0,0,0,0,0,0,22.8,0,39.9,0,96.9,23.6,19.399999999999999,3.69,44.1,16.600000000000001,14.7,2.4900000000000002,0,96.7,0.25,26.2,0,0,0,0,0,0,0,0]
["HSS10X6X3/16","HSS","F",19.661088631907809,5.37,0,10,0,0,6,0,0,0,0,0.1875,0.17399999999999999,0,0,0,0,0,0,0,0,0,31.5,0,54.5,0,74.599999999999994,18,14.9,3.73,34.1,12.7,11.4,2.52,0,73.8,0.1875,19.899999999999999,0,0,0,0,0,0,0,0]
["HSS10X6X3/8","HSS","F",37.614126502748881,10.4,0,10,0,0,6,0,0,0,0,0.375,0.34899999999999998,0,0,0,0,0,0,0,0,0,14.2,0,25.7,0,137,33.799999999999997,27.4,3.63,61.8,23.7,20.6,2.44,0,139,0.375,37.9,0,0,0,0,0,0,0,0]
["HSS10X6X5/16","HSS","F",31.839014548770809,8.76,0,10,0,0,6,0,0,0,0,0.3125,0.29099999999999998,0,0,0,0,0,0,0,0,0,17.600000000000001,0,31.4,0,118,28.8,23.5,3.66,53.3,20.2,17.8,2.4700000000000002,0,118,0.3125,32.200000000000003,0,0,0,0,0,0,0,0]
["HSS10X6X5/8","HSS","F",59.111141401913081,16.399999999999999,0,10,0,0,6,0,0,0,0,0.625,0.58099999999999996,0,0,0,0,0,0,0,0,0,7.33,0,14.2,0,201,51.3,40.200000000000003,3.5,89.4,35.799999999999997,29.8,2.34,0,209,0.625,58.6,0,0,0,0,0,0,0,0]
["HSS10X8X1/2","HSS","F",55.52609431345838,15.3,0,10,0,0,8,0,0,0,0,0.5,0.46500000000000002,0,0,0,0,0,0,0,0,0,14.2,0,18.5,0,214,51.9,42.7,3.73,151,44.5,37.799999999999997,3.14,0,288,0.5,66.400000000000006,0,0,0,0,0,0,0,0]
["HSS10X8X1/4","HSS","F",29.194682414229042,8.0299999999999994,0,10,0,0,8,0,0,0,0,0.25,0.23300000000000001,0,0,0,0,0,0,0,0,0,31.3,0,39.9,0,119,28.1,23.8,3.85,84.7,24.2,21.2,3.25,0,155,0.25,35.299999999999997,0,0,0,0,0,0,0,0]
["HSS10X8X3/16","HSS","F",22.2199775207967,6.06,0,10,0,0,8,0,0,0,0,0.1875,0.17399999999999999,0,0,0,0,0,0,0,0,0,43,0,54.5,0,91.4,21.4,18.3,3.88,65.099999999999994,18.399999999999999,16.3,3.28,0,118,0.1875,26.7,0,0,0,0,0,0,0,0]
["HSS10X8X3/8","HSS","F",42.718293169415546,11.8,0,10,0,0,8,0,0,0,0,0.375,0.34899999999999998,0,0,0,0,0,0,0,0,0,19.899999999999999,0,25.7,0,169,40.5,33.9,3.79,120,34.799999999999997,30,3.19,0,224,0.375,51.4,0,0,0,0,0,0,0,0]
["HSS10X8X5/16","HSS","F",36.099292326548586,9.92,0,10,0,0,8,0,0,0,0,0.3125,0.29099999999999998,0,0,0,0,0,0,0,0,0,24.5,0,31.4,0,145,34.4,29,3.82,103,29.6,25.7,3.22,0,190,0.3125,43.5,0,0,0,0,0,0,0,0]
["HSS10X8X5/8","HSS","F",67.61808584635753,18.7,0,10,0,0,8,0,0,0,0,0.625,0.58099999999999996,0,0,0,0,0,0,0,0,0,10.8,0,14.2,0,253,62.2,50.5,3.68,178,53.3,44.5,3.09,0,346,0.625,80.400000000000006,0,0,0,0,0,0,0,0]
["HSS12.750X0.250","HSS","F",33.406692713953966,9.16,0,0,12.75,0,0,0,0,0,0,0.25,0.23300000000000001,0,0,0,0,0,0,0,0,0,0,0,0,54.7,180,36.5,28.2,4.43,180,36.5,28.2,4.43,0,359,0,56.3,0,0,0,0,0,0,0,0]
["HSS12.750X0.375","HSS","F",49.608938680221634,13.6,0,0,12.75,0,0,0,0,0,0,0.375,0.34899999999999998,0,0,0,0,0,0,0,0,0,0,0,0,36.5,262,53.7,41,4.3899999999999997,262,53.7,41,4.3899999999999997,0,523,0,82.1,0,0,0,0,0,0,0,0]
["HSS12.750X0.500","HSS","F",65.477117719349764,17.899999999999999,0,0,12.75,0,0,0,0,0,0,0.5,0.46500000000000002,0,0,0,0,0,0,0,0,0,0,0,0,27.4,339,70.2,53.2,4.3499999999999996,339,70.2,53.2,4.3499999999999996,0,678,0,106,0,0,0,0,0,0,0,0]
["HSS12X10X1/2","HSS","F",69.137205424569487,19,0,12,0,0,10,0,0,0,0,0.5,0.46500000000000002,0,0,0,0,0,0,0,0,0,18.5,0,22.8,0,395,78.8,65.900000000000006,4.5599999999999996,298,69.599999999999994,59.7,3.96,0,545,0.5,102,0,0,0,0,0,0,0,0]
["HSS12X10X1/4","HSS","F",36.0002379697846,9.9,0,12,0,0,10,0,0,0,0,0.25,0.23300000000000001,0,0,0,0,0,0,0,0,0,39.9,0,48.5,0,216,42.1,36,4.67,164,37.200000000000003,32.700000000000003,4.07,0,289,0.25,53.5,0,0,0,0,0,0,0,0]
["HSS12X10X3/8","HSS","F",52.926626502748874,14.6,0,12,0,0,10,0,0,0,0,0.375,0.34899999999999998,0,0,0,0,0,0,0,0,0,25.7,0,31.4,0,310,61.1,51.6,4.6100000000000003,234,54,46.9,4.01,0,421,0.375,78.3,0,0,0,0,0,0,0,0]
["HSS12X10X5/16","HSS","F",44.619847882104139,12.2,0,12,0,0,10,0,0,0,0,0.3125,0.29099999999999998,0,0,0,0,0,0,0,0,0,31.4,0,38.200000000000003,0,264,51.7,44,4.6399999999999997,200,45.7,40,4.04,0,356,0.3125,66.099999999999994,0,0,0,0,0,0,0,0]
["HSS12X12X1/2","HSS","F",75.942760980125044,20.9,0,12,0,0,12,0,0,0,0,0.5,0.46500000000000002,0,0,0,0,0,0,0,0,0,22.8,0,22.8,0,457,89.6,76.2,4.68,0,0,0,0,0,728,0,123,0,0,0,0,0,0,0,0]
["HSS12X12X1/4","HSS","F",39.403015747562378,10.8,0,12,0,0,12,0,0,0,0,0.25,0.23300000000000001,0,0,0,0,0,0,0,0,0,48.5,0,48.5,0,248,47.6,41.4,4.79,0,0,0,0,0,384,0,64.5,0,0,0,0,0,0,0,0]
["HSS12X12X3/16","HSS","F",29.819714187463362,8.15,0,12,0,0,12,0,0,0,0,0.1875,0.17399999999999999,0,0,0,0,0,0,0,0,0,66,0,66,0,189,36,31.5,4.82,0,0,0,0,0,290,0,48.6,0,0,0,0,0,0,0,0]
["HSS12X12X3/8","HSS","F",58.030793169415539,16,0,12,0,0,12,0,0,0,0,0.375,0.34899999999999998,0,0,0,0,0,0,0,0,0,31.4,0,31.4,0,357,69.2,59.5,4.7300000000000004,0,0,0,0,0,561,0,94.6,0,0,0,0,0,0,0,0]
["HSS12X12X5/16","HSS","F",48.806380659881917,13.4,0,12,0,0,12,0,0,0,0,0.3125,0.29099999999999998,0,0,0,0,0,0,0,0,0,38.200000000000003,0,38.200000000000003,0,304,58.6,50.7,4.76,0,0,0,0,0,474,0,79.7,0,0,0,0,0,0,0,0]
["HSS12X12X5/8","HSS","F",93.138919179690859,25.7,0,12,0,0,12,0,0,0,0,0.625,0.58099999999999996,0,0,0,0,0,0,0,0,0,17.7,0,17.7,0,548,109,91.4,4.62,0,0,0,0,0,885,0,151,0,0,0,0,0,0,0,0]
["HSS12X2X1/4","HSS","F",22.389126858673485,6.17,0,12,0,0,2,0,0,0,0,0.25,0.23300000000000001,0,0,0,0,0,0,0,0,0,5.58,0,48.5,0,86.9,20.100000000000001,14.5,3.75,4.41,5.08,4.41,0.84499999999999997,0,15.1,0.25,9.64,0,0,0,0,0,0,0,0]
["HSS12X2X3/16","HSS","F",17.102199743018918,4.67,0,12,0,0,2,0,0,0,0,0.1875,0.17399999999999999,0,0,0,0,0,0,0,0,0,8.49,0,66,0,67.400000000000006,15.5,11.2,3.8,3.55,3.97,3.55,0.872,0,12,0.1875,7.49,0,0,0,0,0,0,0,0]
["HSS12X2X5/16","HSS","F",27.578736770993032,7.59,0,12,0,0,2,0,0,0,0,0.3125,0.29099999999999998,0,0,0,0,0,0,0,0,0,3.87,0,38.200000000000003,0,104,24.5,17.399999999999999,3.71,5.0999999999999996,6.05,5.0999999999999996,0.82,0,17.600000000000001,0.3125,11.6,0,0,0,0,0,0,0,0]
["HSS12X3-1/2X3/8","HSS","F",36.338084836082217,10,0,12,0,0,3.5,0,0,0,0,0.375,0.34899999999999998,0,0,0,0,0,0,0,0,0,7.03,0,31.4,0,156,34.700000000000003,26,3.94,21.3,14,12.2,1.46,0,64.7,0.375,25.5,0,0,0,0,0,0,0,0]
["HSS12X3-1/2X5/16","HSS","F",30.773945104326366,8.4600000000000009,0,12,0,0,3.5,0,0,0,0,0.3125,0.29099999999999998,0,0,0,0,0,0,0,0,0,9.0299999999999994,0,38.200000000000003,0,134,29.6,22.4,3.98,18.600000000000001,12.1,10.6,1.48,0,56,0.3125,21.8,0,0,0,0,0,0,0,0]
["HSS12X3X1/4","HSS","F",24.090515747562375,6.63,0,12,0,0,3,0,0,0,0,0.25,0.23300000000000001,0,0,0,0,0,0,0,0,0,9.8800000000000008,0,48.5,0,103,22.9,17.2,3.94,11.1,8.2799999999999994,7.38,1.29,0,34.5,0.25,15.1,0,0,0,0,0,0,0,0]
["HSS12X3X3/16","HSS","F",18.381644187463365,5.0199999999999996,0,12,0,0,3,0,0,0,0,0.1875,0.17399999999999999,0,0,0,0,0,0,0,0,0,14.2,0,66,0,79.599999999999994,17.5,13.3,3.98,8.7200000000000006,6.4,5.81,1.32,0,26.8,0.1875,11.6,0,0,0,0,0,0,0,0]
["HSS12X3X5/16","HSS","F",29.708875659881919,8.17,0,12,0,0,3,0,0,0,0,0.3125,0.29099999999999998,0,0,0,0,0,0,0,0,0,7.31,0,38.200000000000003,0,124,27.9,20.7,3.9,13.1,10,8.73,1.27,0,41.3,0.3125,18.399999999999999,0,0,0,0,0,0,0,0]
["HSS12X4X1/2","HSS","F",48.720538757902816,13.5,0,12,0,0,4,0,0,0,0,0.5,0.46500000000000002,0,0,0,0,0,0,0,0,0,5.6,0,22.8,0,210,46.7,34.9,3.95,35.299999999999997,20.9,17.7,1.62,0,105,0.5,37.5,0,0,0,0,0,0,0,0]
["HSS12X4X1/4","HSS","F",25.791904636451264,7.1,0,12,0,0,4,0,0,0,0,0.25,0.23300000000000001,0,0,0,0,0,0,0,0,0,14.2,0,48.5,0,119,25.6,19.899999999999999,4.0999999999999996,21,11.7,10.5,1.72,0,59.8,0.25,20.6,0,0,0,0,0,0,0,0]
["HSS12X4X3/16","HSS","F",19.661088631907809,5.37,0,12,0,0,4,0,0,0,0,0.1875,0.17399999999999999,0,0,0,0,0,0,0,0,0,20,0,66,0,91.8,19.600000000000001,15.3,4.13,16.399999999999999,9,8.1999999999999993,1.75,0,46.1,0.1875,15.7,0,0,0,0,0,0,0,0]
["HSS12X4X3/8","HSS","F",37.614126502748881,10.4,0,12,0,0,4,0,0,0,0,0.375,0.34899999999999998,0,0,0,0,0,0,0,0,0,8.4600000000000009,0,31.4,0,168,36.700000000000003,28,4.0199999999999996,28.9,16.600000000000001,14.5,1.67,0,84.1,0.375,29.5,0,0,0,0,0,0,0,0]
["HSS12X4X5/16","HSS","F",31.839014548770809,8.76,0,12,0,0,4,0,0,0,0,0.3125,0.29099999999999998,0,0,0,0,0,0,0,0,0,10.7,0,38.200000000000003,0,144,31.3,24.1,4.0599999999999996,25.2,14.2,12.6,1.7,0,72.400000000000006,0.3125,25.2,0,0,0,0,0,0,0,0]
["HSS12X4X5/8","HSS","F",59.111141401913081,16.399999999999999,0,12,0,0,4,0,0,0,0,0.625,0.58099999999999996,0,0,0,0,0,0,0,0,0,3.88,0,17.7,0,245,55.5,40.799999999999997,3.87,40.4,24.5,20.2,1.57,0,122,0.625,44.6,0,0,0,0,0,0,0,0]
["HSS12X6X1/2","HSS","F",55.52609431345838,15.3,0,12,0,0,6,0,0,0,0,0.5,0.46500000000000002,0,0,0,0,0,0,0,0,0,9.9,0,22.8,0,271,57.4,45.2,4.21,91.1,35.200000000000003,30.4,2.44,0,227,0.5,59,0,0,0,0,0,0,0,0]
["HSS12X6X1/4","HSS","F",29.194682414229042,8.0299999999999994,0,12,0,0,6,0,0,0,0,0.25,0.23300000000000001,0,0,0,0,0,0,0,0,0,22.8,0,48.5,0,151,31.1,25.2,4.34,51.9,19.3,17.3,2.54,0,124,0.25,31.6,0,0,0,0,0,0,0,0]
["HSS12X6X3/16","HSS","F",22.2199775207967,6.06,0,12,0,0,6,0,0,0,0,0.1875,0.17399999999999999,0,0,0,0,0,0,0,0,0,31.5,0,66,0,116,23.7,19.399999999999999,4.38,40,14.7,13.3,2.57,0,94.6,0.1875,24,0,0,0,0,0,0,0,0]
["HSS12X6X3/8","HSS","F",42.718293169415546,11.8,0,12,0,0,6,0,0,0,0,0.375,0.34899999999999998,0,0,0,0,0,0,0,0,0,14.2,0,31.4,0,215,44.8,35.9,4.28,72.900000000000006,27.7,24.3,2.4900000000000002,0,178,0.375,45.8,0,0,0,0,0,0,0,0]
["HSS12X6X5/16","HSS","F",36.099292326548586,9.92,0,12,0,0,6,0,0,0,0,0.3125,0.29099999999999998,0,0,0,0,0,0,0,0,0,17.600000000000001,0,38.200000000000003,0,184,38.1,30.7,4.3099999999999996,62.8,23.6,20.9,2.52,0,152,0.3125,38.799999999999997,0,0,0,0,0,0,0,0]
["HSS12X6X5/8","HSS","F",67.61808584635753,18.7,0,12,0,0,6,0,0,0,0,0.625,0.58099999999999996,0,0,0,0,0,0,0,0,0,7.33,0,17.7,0,321,68.8,53.4,4.1399999999999997,107,42.1,35.5,2.39,0,271,0.625,71.099999999999994,0,0,0,0,0,0,0,0]
["HSS12X8X1/2","HSS","F",62.33164986901393,17.2,0,12,0,0,8,0,0,0,0,0.5,0.46500000000000002,0,0,0,0,0,0,0,0,0,14.2,0,22.8,0,333,68.099999999999994,55.6,4.41,178,51.5,44.4,3.21,0,377,0.5,80.400000000000006,0,0,0,0,0,0,0,0]
["HSS12X8X1/4","HSS","F",32.597460192006821,8.9600000000000009,0,12,0,0,8,0,0,0,0,0.25,0.23300000000000001,0,0,0,0,0,0,0,0,0,31.3,0,48.5,0,184,36.6,30.6,4.53,98.8,27.8,24.7,3.32,0,202,0.25,42.5,0,0,0,0,0,0,0,0]
["HSS12X8X3/16","HSS","F",24.778866409685588,6.76,0,12,0,0,8,0,0,0,0,0.18779999999999999,0.17399999999999999,0,0,0,0,0,0,0,0,0,43,0,66,0,140,27.8,23.4,4.5599999999999996,75.7,21.1,18.899999999999999,3.35,0,153,0.1875,32.200000000000003,0,0,0,0,0,0,0,0]
["HSS12X8X3/8","HSS","F",47.82245983608221,13.2,0,12,0,0,8,0,0,0,0,0.375,0.34899999999999998,0,0,0,0,0,0,0,0,0,19.899999999999999,0,31.4,0,262,53,43.7,4.47,140,40.1,35.1,3.27,0,293,0.375,62.1,0,0,0,0,0,0,0,0]
["HSS12X8X5/16","HSS","F",40.359570104326366,11.1,0,12,0,0,8,0,0,0,0,0.3125,0.29099999999999998,0,0,0,0,0,0,0,0,0,24.5,0,38.200000000000003,0,224,44.9,37.4,4.5,120,34.1,30.1,3.29,0,248,0.3125,52.4,0,0,0,0,0,0,0,0]
["HSS12X8X5/8","HSS","F",76.125030290801973,21,0,12,0,0,8,0,0,0,0,0.625,0.58099999999999996,0,0,0,0,0,0,0,0,0,10.8,0,17.7,0,397,82.1,66.099999999999994,4.34,210,61.9,52.5,3.16,0,454,0.625,97.7,0,0,0,0,0,0,0,0]
["HSS14X0.250","HSS","F",36.747361985349357,10.1,0,0,14,0,0,0,0,0,0,0.25,0.23300000000000001,0,0,0,0,0,0,0,0,0,0,0,0,60.1,239,44.2,34.1,4.87,239,44.2,34.1,4.87,0,478,0,68.2,0,0,0,0,0,0,0,0]
["HSS14X0.312","HSS","F",45.653917657281234,12.5,0,0,14,0,0,0,0,0,0,0.3125,0.29099999999999998,0,0,0,0,0,0,0,0,0,0,0,0,48.1,295,54.7,42.1,4.8499999999999996,295,54.7,42.1,4.8499999999999996,0,589,0,84.2,0,0,0,0,0,0,0,0]
["HSS14X0.375","HSS","F",54.619942587314732,15,0,0,14,0,0,0,0,0,0,0.375,0.34899999999999998,0,0,0,0,0,0,0,0,0,0,0,0,40.1,349,65.099999999999994,49.8,4.83,349,65.099999999999994,49.8,4.83,0,698,0,100,0,0,0,0,0,0,0,0]
["HSS14X0.500","HSS","F",72.158456262140561,19.8,0,0,14,0,0,0,0,0,0,0.5,0.46500000000000002,0,0,0,0,0,0,0,0,0,0,0,0,30.1,453,85.2,64.8,4.79,453,85.2,64.8,4.79,0,907,0,130,0,0,0,0,0,0,0,0]
["HSS14X0.625","HSS","F",89.362903009826852,24.5,0,0,14,0,0,0,0,0,0,0.625,0.58099999999999996,0,0,0,0,0,0,0,0,0,0,0,0,24.1,552,105,78.900000000000006,4.75,552,105,78.900000000000006,4.75,0,1100,0,158,0,0,0,0,0,0,0,0]
["HSS14X10X1/2","HSS","F",75.942760980125044,20.9,0,14,0,0,10,0,0,0,0,0.5,0.46500000000000002,0,0,0,0,0,0,0,0,0,18.5,0,27.1,0,573,98.8,81.8,5.23,341,78.5,68.099999999999994,4.04,0,685,0.5,120,0,0,0,0,0,0,0,0]
["HSS14X10X1/4","HSS","F",39.47833963645126,10.8,0,14,0,0,10,0,0,0,0,0.25,0.23300000000000001,0,0,0,0,0,0,0,0,0,39.9,0,57.1,0,310,52.4,44.3,5.35,186,41.8,37.200000000000003,4.1399999999999997,0,362,0.25,62.6,0,0,0,0,0,0,0,0]
["HSS14X10X3/8","HSS","F",58.074092836082208,16,0,14,0,0,10,0,0,0,0,0.375,0.34899999999999998,0,0,0,0,0,0,0,0,0,25.7,0,37.1,0,447,76.3,63.9,5.29,267,60.7,53.4,4.09,0,528,0.375,91.8,0,0,0,0,0,0,0,0]
["HSS14X10X5/16","HSS","F",48.865376659881925,13.4,0,14,0,0,10,0,0,0,0,0.3125,0.29099999999999998,0,0,0,0,0,0,0,0,0,31.4,0,45.1,0,380,64.599999999999994,54.3,5.32,227,51.4,45.5,4.12,0,446,0.3125,77.400000000000006,0,0,0,0,0,0,0,0]
["HSS14X10X5/8","HSS","F",93.09940884635752,25.7,0,14,0,0,10,0,0,0,0,0.625,0.58099999999999996,0,0,0,0,0,0,0,0,0,14.2,0,21.1,0,687,120,98.2,5.17,407,95.1,81.5,3.98,0,832,0.625,146,0,0,0,0,0,0,0,0]
["HSS14X14X1/2","HSS","F",89.553872091236158,24.6,0,14,0,0,14,0,0,0,0,0.5,0.46500000000000002,0,0,0,0,0,0,0,0,0,27.1,0,27.1,0,743,124,106,5.49,0,0,0,0,0,1170,0,170,0,0,0,0,0,0,0,0]
["HSS14X14X3/8","HSS","F",68.239126502748874,18.7,0,14,0,0,14,0,0,0,0,0.375,0.34899999999999998,0,0,0,0,0,0,0,0,0,37.1,0,37.1,0,577,95.4,82.5,5.55,0,0,0,0,0,900,0,130,0,0,0,0,0,0,0,0]
["HSS14X14X5/16","HSS","F",57.313325104326367,15.7,0,14,0,0,14,0,0,0,0,0.3125,0.29099999999999998,0,0,0,0,0,0,0,0,0,45.1,0,45.1,0,490,80.5,69.900000000000006,5.58,0,0,0,0,0,759,0,109,0,0,0,0,0,0,0,0]
["HSS14X14X5/8","HSS","F",110,30.3,0,14,0,0,14,0,0,0,0,0.625,0.58099999999999996,0,0,0,0,0,0,0,0,0,21.1,0,21.1,0,897,151,128,5.44,0,0,0,0,0,1430,0,208,0,0,0,0,0,0,0,0]
["HSS14X4X1/2","HSS","F",55.52609431345838,15.3,0,14,0,0,4,0,0,0,0,0.5,0.46500000000000002,0,0,0,0,0,0,0,0,0,5.6,0,27.1,0,317,61,45.3,4.55,41.2,24.1,20.6,1.64,0,127,0.5,44.1,0,0,0,0,0,0,0,0]
["HSS14X4X1/4","HSS","F",29.249589636451262,8.0299999999999994,0,14,0,0,4,0,0,0,0,0.25,0.23300000000000001,0,0,0,0,0,0,0,0,0,14.2,0,57.1,0,178,33.200000000000003,25.4,4.71,24.4,13.5,12.2,1.74,0,72.400000000000006,0.25,24.1,0,0,0,0,0,0,0,0]
["HSS14X4X3/16","HSS","F",22.118253520796696,6.06,0,14,0,0,4,0,0,0,0,0.1875,0.17399999999999999,0,0,0,0,0,0,0,0,0,20,0,77.5,0,137,25.3,19.5,4.74,19,10.3,9.48,1.77,0,55.8,0.1875,18.399999999999999,0,0,0,0,0,0,0,0]
["HSS14X4X3/8","HSS","F",42.749342836082214,11.8,0,14,0,0,4,0,0,0,0,0.375,0.34899999999999998,0,0,0,0,0,0,0,0,0,8.4600000000000009,0,37.1,0,252,47.8,36,4.63,33.6,19.100000000000001,16.8,1.69,0,102,0.375,34.6,0,0,0,0,0,0,0,0]
["HSS14X4X5/16","HSS","F",36.088626659881918,9.92,0,14,0,0,4,0,0,0,0,0.3125,0.29099999999999998,0,0,0,0,0,0,0,0,0,10.7,0,45.1,0,216,40.6,30.9,4.67,29.2,16.399999999999999,14.6,1.72,0,87.7,0.3125,29.5,0,0,0,0,0,0,0,0]
["HSS14X4X5/8","HSS","F",67.5908255130242,18.7,0,14,0,0,4,0,0,0,0,0.625,0.58099999999999996,0,0,0,0,0,0,0,0,0,3.88,0,21.1,0,373,73.099999999999994,53.3,4.47,47.2,28.5,23.6,1.59,0,148,0.625,52.6,0,0,0,0,0,0,0,0]
["HSS14X6X1/2","HSS","F",62.33164986901393,17.2,0,14,0,0,6,0,0,0,0,0.5,0.46500000000000002,0,0,0,0,0,0,0,0,0,9.9,0,27.1,0,402,73.599999999999994,57.4,4.84,105,40.4,35.1,2.48,0,279,0.5,69.3,0,0,0,0,0,0,0,0]
["HSS14X6X1/4","HSS","F",32.659172969784599,8.9600000000000009,0,14,0,0,6,0,0,0,0,0.25,0.23300000000000001,0,0,0,0,0,0,0,0,0,22.8,0,57.1,0,222,39.6,31.7,4.9800000000000004,59.6,22,19.899999999999999,2.58,0,152,0.25,36.9,0,0,0,0,0,0,0,0]
["HSS14X6X3/16","HSS","F",24.664892409685585,6.76,0,14,0,0,6,0,0,0,0,0.1875,0.17399999999999999,0,0,0,0,0,0,0,0,0,31.5,0,77.5,0,170,30.1,24.3,5.01,45.9,16.7,15.3,2.61,0,116,0.1875,28,0,0,0,0,0,0,0,0]
["HSS14X6X3/8","HSS","F",47.857592836082212,13.2,0,14,0,0,6,0,0,0,0,0.375,0.34899999999999998,0,0,0,0,0,0,0,0,0,14.2,0,37.1,0,317,57.3,45.3,4.91,84.1,31.6,28,2.5299999999999998,0,219,0.375,53.7,0,0,0,0,0,0,0,0]
["HSS14X6X5/16","HSS","F",40.347543326548589,11.1,0,14,0,0,6,0,0,0,0,0.3125,0.29099999999999998,0,0,0,0,0,0,0,0,0,17.600000000000001,0,45.1,0,271,48.6,38.700000000000003,4.9400000000000004,72.3,26.9,24.1,2.5499999999999998,0,186,0.3125,45.5,0,0,0,0,0,0,0,0]
["HSS14X6X5/8","HSS","F",76.093686624135302,21,0,14,0,0,10,0,0,0,0,0.625,0.58099999999999996,0,0,0,0,0,0,0,0,0,7.33,0,21.1,0,478,88.7,68.3,4.7699999999999996,124,48.4,41.2,2.4300000000000002,0,334,0.625,83.7,0,0,0,0,0,0,0,0]
["HSS16X0.250","HSS","F",42.092432819581994,11.5,0,0,16,0,0,0,0,0,0,0.25,0.23300000000000001,0,0,0,0,0,0,0,0,0,0,0,0,68.7,359,57.9,44.8,5.58,359,57.9,44.8,5.58,0,717,0,89.7,0,0,0,0,0,0,0,0]
["HSS16X0.312","HSS","F",52.324566058403583,14.4,0,0,16,0,0,0,0,0,0,0.3125,0.29099999999999998,0,0,0,0,0,0,0,0,0,0,0,0,55,443,71.8,55.4,5.55,443,71.8,55.4,5.55,0,886,0,111,0,0,0,0,0,0,0,0]
["HSS16X0.375","HSS","F",62.637548838663676,17.2,0,0,16,0,0,0,0,0,0,0.375,0.34899999999999998,0,0,0,0,0,0,0,0,0,0,0,0,45.8,526,85.5,65.7,5.53,526,85.5,65.7,5.53,0,1050,0,131,0,0,0,0,0,0,0,0]
["HSS16X0.438","HSS","F",72.865673274359466,19.899999999999999,0,0,16,0,0,0,0,0,0,0.4375,0.40699999999999997,0,0,0,0,0,0,0,0,0,0,0,0,39.299999999999997,606,99,75.8,5.51,606,99,75.8,5.51,0,1210,0,152,0,0,0,0,0,0,0,0]
["HSS16X0.500","HSS","F",82.84859793060582,22.7,0,0,16,0,0,0,0,0,0,0.5,0.46500000000000002,0,0,0,0,0,0,0,0,0,0,0,0,34.4,685,112,85.7,5.49,685,112,85.7,5.49,0,1370,0,171,0,0,0,0,0,0,0,0]
["HSS16X0.625","HSS","F",103,28.1,0,0,16,0,0,0,0,0,0,0.625,0.58099999999999996,0,0,0,0,0,0,0,0,0,0,0,0,27.5,838,138,105,5.46,838,138,105,5.46,0,1680,0,209,0,0,0,0,0,0,0,0]
["HSS16X12X1/2","HSS","F",89.553872091236158,24.6,0,16,0,0,12,0,0,0,0,0.5,0.46500000000000002,0,0,0,0,0,0,0,0,0,22.8,0,31.4,0,904,135,113,6.06,581,111,96.8,4.8600000000000003,0,1120,0.5,166,0,0,0,0,0,0,0,0]
["HSS16X12X3/8","HSS","F",68.290592836082212,18.7,0,16,0,0,12,0,0,0,0,0.375,0.34899999999999998,0,0,0,0,0,0,0,0,0,31.4,0,42.8,0,702,104,87.7,6.12,452,85.5,75.3,4.91,0,862,0.375,127,0,0,0,0,0,0,0,0]
["HSS16X12X5/16","HSS","F",57.38320999321526,15.7,0,16,0,0,12,0,0,0,0,0.3125,0.29099999999999998,0,0,0,0,0,0,0,0,0,38.200000000000003,0,52,0,595,87.7,74.400000000000006,6.15,384,72.2,64,4.9400000000000004,0,727,0.3125,107,0,0,0,0,0,0,0,0]
["HSS16X12X5/8","HSS","F",110,30.3,0,16,0,0,12,0,0,0,0,0.625,0.58099999999999996,0,0,0,0,0,0,0,0,0,17.7,0,24.5,0,1090,165,136,6,700,135,117,4.8,0,1370,0.625,204,0,0,0,0,0,0,0,0]
["HSS16X16X1/2","HSS","F",103,28.3,0,16,0,0,16,0,0,0,0,0.5,0.46500000000000002,0,0,0,0,0,0,0,0,0,31.4,0,31.4,0,1130,164,141,6.31,0,0,0,0,0,1770,0,224,0,0,0,0,0,0,0,0]
["HSS16X16X3/8","HSS","F",78.447459836082203,21.5,0,16,0,0,16,0,0,0,0,0.375,0.34899999999999998,0,0,0,0,0,0,0,0,0,42.8,0,42.8,0,873,126,109,6.37,0,0,0,0,0,1350,0,171,0,0,0,0,0,0,0,0]
["HSS16X16X5/16","HSS","F",65.82026954877081,18.100000000000001,0,16,0,0,16,0,0,0,0,0.3125,0.29099999999999998,0,0,0,0,0,0,0,0,0,52,0,52,0,739,106,92.3,6.39,0,0,0,0,0,1140,0,144,0,0,0,0,0,0,0,0]
["HSS16X16X5/8","HSS","F",127,35,0,16,0,0,16,0,0,0,0,0.625,0.58099999999999996,0,0,0,0,0,0,0,0,0,24.5,0,24.5,0,1370,200,171,6.25,0,0,0,0,0,2170,0,276,0,0,0,0,0,0,0,0]
["HSS16X4X1/2","HSS","F",62.33164986901393,17.2,0,16,0,0,4,0,0,0,0,0.5,0.46500000000000002,0,0,0,0,0,0,0,0,0,5.6,0,31.4,0,455,77.3,56.9,5.15,47,27.4,23.5,1.65,0,150,0.5,50.7,0,0,0,0,0,0,0,0]
["HSS16X4X1/4","HSS","F",32.659172969784599,8.9600000000000009,0,16,0,0,4,0,0,0,0,0.25,0.23300000000000001,0,0,0,0,0,0,0,0,0,14.2,0,65.7,0,253,41.7,31.6,5.31,27.7,15.2,13.8,1.76,0,85.2,0.25,27.6,0,0,0,0,0,0,0,0]
["HSS16X4X3/16","HSS","F",24.664892409685585,6.76,0,14,0,0,4,0,0,0,0,0.1875,0.17399999999999999,0,0,0,0,0,0,0,0,0,20,0,89,0,193,31.7,24.2,5.35,21.5,11.7,10.8,1.78,0,65.5,0.1875,21.1,0,0,0,0,0,0,0,0]
["HSS16X4X3/8","HSS","F",47.857592836082212,13.2,0,16,0,0,4,0,0,0,0,0.375,0.34899999999999998,0,0,0,0,0,0,0,0,0,8.4600000000000009,0,42.8,0,360,60.2,45,5.23,38.299999999999997,21.7,19.100000000000001,1.71,0,120,0.375,39.700000000000003,0,0,0,0,0,0,0,0]
["HSS16X4X5/16","HSS","F",40.347543326548589,11.1,0,16,0,0,4,0,0,0,0,0.3125,0.29099999999999998,0,0,0,0,0,0,0,0,0,10.7,0,52,0,308,51.1,38.5,5.27,33.200000000000003,18.5,16.600000000000001,1.73,0,103,0.3125,33.799999999999997,0,0,0,0,0,0,0,0]
["HSS16X4X5/8","HSS","F",76.093686624135302,21,0,16,0,0,4,0,0,0,0,0.625,0.58099999999999996,0,0,0,0,0,0,0,0,0,3.88,0,24.5,0,539,92.9,67.3,5.0599999999999996,54.1,32.5,27,1.6,0,174,0.625,60.5,0,0,0,0,0,0,0,0]
["HSS16X8X1/2","HSS","F",75.942760980125044,20.9,0,16,0,0,8,0,0,0,0,0.5,0.46500000000000002,0,0,0,0,0,0,0,0,0,14.2,0,31.4,0,679,106,84.9,5.7,230,65.5,57.6,3.32,0,563,0.5,108,0,0,0,0,0,0,0,0]
["HSS16X8X1/4","HSS","F",39.47833963645126,10.8,0,16,0,0,8,0,0,0,0,0.25,0.23300000000000001,0,0,0,0,0,0,0,0,0,31.3,0,65.7,0,368,56.4,46.1,5.83,127,35,31.7,3.42,0,300,0.25,57,0,0,0,0,0,0,0,0]
["HSS16X8X3/8","HSS","F",58.074092836082208,16,0,16,0,0,8,0,0,0,0,0.375,0.34899999999999998,0,0,0,0,0,0,0,0,0,19.899999999999999,0,42.8,0,531,82.1,66.3,5.77,181,50.8,45.3,3.37,0,436,0.375,83.4,0,0,0,0,0,0,0,0]
["HSS16X8X5/16","HSS","F",48.865376659881925,13.4,0,16,0,0,8,0,0,0,0,0.3125,0.29099999999999998,0,0,0,0,0,0,0,0,0,24.5,0,52,0,451,69.400000000000006,56.4,5.8,155,43,38.700000000000003,3.4,0,369,0.3125,70.400000000000006,0,0,0,0,0,0,0,0]
["HSS16X8X5/8","HSS","F",93.09940884635752,25.7,0,16,0,0,8,0,0,0,0,0.3125,0.58099999999999996,0,0,0,0,0,0,0,0,0,10.8,0,24.5,0,815,129,102,5.64,274,79.2,68.599999999999994,3.27,0,681,0.625,132,0,0,0,0,0,0,0,0]
["HSS18X0.375","HSS","F",70.655155090012627,19.399999999999999,0,0,18,0,0,0,0,0,0,0.375,0.34899999999999998,0,0,0,0,0,0,0,0,0,0,0,0,51.6,754,109,83.8,6.24,754,109,83.8,6.24,0,1510,0,168,0,0,0,0,0,0,0,0]
["HSS18X0.500","HSS","F",93.538739599071093,25.6,0,0,18,0,0,0,0,0,0,0.5,0.46500000000000002,0,0,0,0,0,0,0,0,0,0,0,0,38.700000000000003,985,143,109,6.2,985,143,109,6.2,0,1970,0,219,0,0,0,0,0,0,0,0]
["HSS18X6X1/2","HSS","F",75.942760980125044,20.9,0,18,0,0,6,0,0,0,0,0.5,0.46500000000000002,0,0,0,0,0,0,0,0,0,9.9,0,35.700000000000003,0,770,112,85.6,6.07,134,50.7,44.6,2.5299999999999998,0,387,0.5,89.9,0,0,0,0,0,0,0,0]
["HSS18X6X1/4","HSS","F",39.47833963645126,10.8,0,18,0,0,6,0,0,0,0,0.25,0.23300000000000001,0,0,0,0,0,0,0,0,0,22.8,0,74.3,0,419,59.4,46.5,6.22,75.099999999999994,27.3,25,2.63,0,210,0.25,47.7,0,0,0,0,0,0,0,0]
["HSS18X6X3/8","HSS","F",58.074092836082208,16,0,18,0,0,6,0,0,0,0,0.375,0.34899999999999998,0,0,0,0,0,0,0,0,0,14.2,0,48.6,0,602,86.4,66.900000000000006,6.15,106,39.5,35.5,2.58,0,302,0.375,69.5,0,0,0,0,0,0,0,0]
["HSS18X6X5/16","HSS","F",48.865376659881925,13.4,0,18,0,0,6,0,0,0,0,0.3125,0.29099999999999998,0,0,0,0,0,0,0,0,0,17.600000000000001,0,58.9,0,513,73.099999999999994,57,6.18,91.3,33.5,30.4,2.61,0,257,0.3125,58.7,0,0,0,0,0,0,0,0]
["HSS18X6X5/8","HSS","F",93.09940884635752,25.7,0,18,0,0,6,0,0,0,0,0.625,0.58099999999999996,0,0,0,0,0,0,0,0,0,7.33,0,28,0,923,135,103,6,158,61,52.7,2.48,0,462,0.32500000000000001,109,0,0,0,0,0,0,0,0]
["HSS2.375X0.125","HSS","F",3.0066023442558567,0.82299999999999995,0,0,2.375,0,0,0,0,0,0,0.125,0.11600000000000001,0,0,0,0,0,0,0,0,0,0,0,0,20.5,0.52700000000000002,0.59199999999999997,0.443,0.8,0.52700000000000002,0.59199999999999997,0.443,0.8,0,1.05,0,0.88700000000000001,0,0,0,0,0,0,0,0]
["HSS2.375X0.154","HSS","F",3.6563919154318465,1,0,0,2.375,0,0,0,0,0,0,0.154,0.14299999999999999,0,0,0,0,0,0,0,0,0,0,0,0,16.600000000000001,0.627,0.71299999999999997,0.52800000000000002,0.79100000000000004,0.627,0.71299999999999997,0.52800000000000002,0.79100000000000004,0,1.25,0,1.06,0,0,0,0,0,0,0,0]
["HSS2.375X0.188","HSS","F",4.3953158878395042,1.2,0,0,2.375,0,0,0,0,0,0,0.1875,0.17399999999999999,0,0,0,0,0,0,0,0,0,0,0,0,13.6,0.73299999999999998,0.84499999999999997,0.61699999999999999,0.78100000000000003,0.73299999999999998,0.84499999999999997,0.61699999999999999,0.78100000000000003,0,1.47,0,1.23,0,0,0,0,0,0,0,0]
["HSS2.375X0.218","HSS","F",5.026782556195748,1.39,0,0,2.375,0,0,0,0,0,0,0.218,0.20300000000000001,0,0,0,0,0,0,0,0,0,0,0,0,11.7,0.82399999999999995,0.96,0.69399999999999995,0.77100000000000002,0.82399999999999995,0.96,0.69399999999999995,0.77100000000000002,0,1.65,0,1.39,0,0,0,0,0,0,0,0]
["HSS2.375X0.250","HSS","F",5.6791377613721741,1.57,0,0,2.375,0,0,0,0,0,0,0.25,0.23300000000000001,0,0,0,0,0,0,0,0,0,0,0,0,10.199999999999999,0.91,1.07,0.76600000000000001,0.76200000000000001,0.91,1.07,0.76600000000000001,0.76200000000000001,0,1.82,0,1.53,0,0,0,0,0,0,0,0]
["HSS2.500X0.125","HSS","F",3.1736358078256264,0.86899999999999999,0,0,2.5,0,0,0,0,0,0,0.125,0.11600000000000001,0,0,0,0,0,0,0,0,0,0,0,0,21.6,0.61899999999999999,0.66,0.495,0.84399999999999997,0.61899999999999999,0.66,0.495,0.84399999999999997,0,1.24,0,0.99,0,0,0,0,0,0,0,0]
["HSS2.500X0.188","HSS","F",4.6465342170484387,1.27,0,0,2.5,0,0,0,0,0,0,0.1875,0.17399999999999999,0,0,0,0,0,0,0,0,0,0,0,0,14.4,0.86499999999999999,0.94299999999999995,0.69199999999999995,0.82499999999999996,0.86499999999999999,0.94299999999999995,0.69199999999999995,0.82499999999999996,0,1.73,0,1.38,0,0,0,0,0,0,0,0]
["HSS2.500X0.250","HSS","F",6.0132046885117134,1.66,0,0,2.5,0,0,0,0,0,0,0.25,0.23300000000000001,0,0,0,0,0,0,0,0,0,0,0,0,10.7,1.08,1.2,0.86199999999999999,0.80600000000000005,1.08,1.2,0.86199999999999999,0.80600000000000005,0,2.15,0,1.72,0,0,0,0,0,0,0,0]
["HSS2.875X0.125","HSS","F",3.6747361985349354,1.01,0,0,2.875,0,0,0,0,0,0,0.125,0.11600000000000001,0,0,0,0,0,0,0,0,0,0,0,0,24.8,0.95799999999999996,0.88400000000000001,0.66700000000000004,0.97599999999999998,0.95799999999999996,0.88400000000000001,0.66700000000000004,0.97599999999999998,0,1.92,0,1.33,0,0,0,0,0,0,0,0]
["HSS2.875X0.188","HSS","F",5.4001892046752396,1.48,0,0,2.875,0,0,0,0,0,0,0.1875,0.17399999999999999,0,0,0,0,0,0,0,0,0,0,0,0,16.5,1.35,1.27,0.94099999999999995,0.95699999999999996,1.35,1.27,0.94099999999999995,0.95699999999999996,0,2.7,0,1.88,0,0,0,0,0,0,0,0]
["HSS2.875X0.203","HSS","F",5.7985038832422591,1.59,0,0,2.875,0,0,0,0,0,0,0.20300000000000001,0.189,0,0,0,0,0,0,0,0,0,0,0,0,15.2,1.45,1.37,1.01,0.95199999999999996,1.45,1.37,1.01,0.95199999999999996,0,2.89,0,2.0099999999999998,0,0,0,0,0,0,0,0]
["HSS2.875X0.250","HSS","F",7.0154054699303323,1.93,0,0,2.875,0,0,0,0,0,0,0.25,0.23300000000000001,0,0,0,0,0,0,0,0,0,0,0,0,12.3,1.7,1.63,1.18,0.93799999999999994,1.7,1.63,1.18,0.93799999999999994,0,3.4,0,2.37,0,0,0,0,0,0,0,0]
["HSS20X0.375","HSS","F",78.672761341361593,21.5,0,0,20,0,0,0,0,0,0,0.375,0.34899999999999998,0,0,0,0,0,0,0,0,0,0,0,0,57.3,1040,135,104,6.95,1040,135,104,6.95,0,2080,0,208,0,0,0,0,0,0,0,0]
["HSS20X0.500","HSS","F",104,28.5,0,0,20,0,0,0,0,0,0,0.5,0.46500000000000002,0,0,0,0,0,0,0,0,0,0,0,0,43,1360,177,136,6.91,1360,177,136,6.91,0,2720,0,272,0,0,0,0,0,0,0,0]
["HSS20X12X1/2","HSS","F",103,28.3,0,20,0,0,12,0,0,0,0,0.5,0.46500000000000002,0,0,0,0,0,0,0,0,0,22.8,0,40,0,1550,188,155,7.39,705,132,117,4.99,0,1540,0.5,209,0,0,0,0,0,0,0,0]
["HSS20X12X3/8","HSS","F",78.447459836082203,21.5,0,20,0,0,12,0,0,0,0,0.375,0.34899999999999998,0,0,0,0,0,0,0,0,0,31.4,0,54.3,0,1200,144,120,7.45,547,102,91.1,5.04,0,1180,0.375,160,0,0,0,0,0,0,0,0]
["HSS20X12X5/16","HSS","F",65.82026954877081,18.100000000000001,0,20,0,0,12,0,0,0,0,0.3125,0.29099999999999998,0,0,0,0,0,0,0,0,0,38.200000000000003,0,65.7,0,1010,122,101,7.48,464,85.8,77.3,5.07,0,997,0.3125,134,0,0,0,0,0,0,0,0]
["HSS20X12X5/8","HSS","F",127,35,0,20,0,0,12,0,0,0,0,0.625,0.58099999999999996,0,0,0,0,0,0,0,0,0,17.7,0,31.4,0,1880,230,188,7.33,851,162,142,4.93,0,1890,0.625,257,0,0,0,0,0,0,0,0]
["HSS20X4X1/2","HSS","F",75.942760980125044,20.9,0,20,0,0,4,0,0,0,0,0.5,0.46500000000000002,0,0,0,0,0,0,0,0,0,5.6,0,40,0,838,115,83.8,6.33,58.7,34,29.3,1.68,0,195,0.5,63.8,0,0,0,0,0,0,0,0]
["HSS20X4X1/4","HSS","F",39.47833963645126,10.8,0,20,0,0,4,0,0,0,0,0.25,0.23300000000000001,0,0,0,0,0,0,0,0,0,14.2,0,82.8,0,458,61.5,45.8,6.5,34.299999999999997,18.7,17.100000000000001,1.78,0,111,0.25,34.700000000000003,0,0,0,0,0,0,0,0]
["HSS20X4X3/8","HSS","F",58.074092836082208,16,0,20,0,0,4,0,0,0,0,0.375,0.34899999999999998,0,0,0,0,0,0,0,0,0,8.4600000000000009,0,54.3,0,657,89.3,65.7,6.42,47.6,26.8,23.8,1.73,0,156,0.375,49.9,0,0,0,0,0,0,0,0]
["HSS20X4X5/16","HSS","F",48.865376659881925,13.4,0,20,0,0,4,0,0,0,0,0.3125,0.29099999999999998,0,0,0,0,0,0,0,0,0,10.7,0,65.7,0,560,75.599999999999994,56,6.46,41.2,22.9,20.6,1.75,0,134,0.3125,42.4,0,0,0,0,0,0,0,0]
["HSS20X8X1/2","HSS","F",89.553872091236158,24.6,0,20,0,0,8,0,0,0,0,0.5,0.46500000000000002,0,0,0,0,0,0,0,0,0,14.2,0,40,0,1190,152,119,6.96,283,79.5,70.8,3.39,0,757,0.5,137,0,0,0,0,0,0,0,0]
["HSS20X8X3/8","HSS","F",68.290592836082212,18.7,0,20,0,0,8,0,0,0,0,0.375,0.34899999999999998,0,0,0,0,0,0,0,0,0,19.899999999999999,0,54.3,0,926,117,92.6,7.03,222,61.5,55.6,3.44,0,586,0.375,105,0,0,0,0,0,0,0,0]
["HSS20X8X5/16","HSS","F",57.313325104326367,15.7,0,20,0,0,8,0,0,0,0,0.3125,0.29099999999999998,0,0,0,0,0,0,0,0,0,24.5,0,65.7,0,786,98.6,78.599999999999994,7.07,189,52,47.4,3.47,0,496,0.3125,88.3,0,0,0,0,0,0,0,0]
["HSS20X8X5/8","HSS","F",110,30.3,0,20,0,0,8,0,0,0,0,0.625,0.58099999999999996,0,0,0,0,0,0,0,0,0,10.8,0,31.4,0,1440,185,144,6.89,338,96.4,84.6,3.34,0,916,0.32500000000000001,167,0,0,0,0,0,0,0,0]
["HSS2-1/2X1-1/2X1/4","HSS","F",5.3752379697845996,1.51,0,2.5,0,0,1.5,0,0,0,0,0.25,0.23300000000000001,0,0,0,0,0,0,0,0,0,3.44,0,7.73,0,1.03,1.1100000000000001,0.82199999999999995,0.82599999999999996,0.44900000000000001,0.76400000000000001,0.59899999999999998,0.54600000000000004,0,1.1000000000000001,0.25,1.29,0,0,0,0,0,0,0,0]
["HSS2-1/2X1-1/2X1/8","HSS","F",3.0448729722059391,0.84,0,2.5,0,0,1.5,0,0,0,0,0.125,0.11600000000000001,0,0,0,0,0,0,0,0,0,9.93,0,18.600000000000001,0,0.66800000000000004,0.67100000000000004,0.53500000000000003,0.89200000000000002,0.3,0.46899999999999997,0.39900000000000002,0.59699999999999998,0,0.68700000000000006,0.125,0.75900000000000001,0,0,0,0,0,0,0,0]
["HSS2-1/2X1-1/2X3/16","HSS","F",4.3077552985744747,1.19,0,2.5,0,0,1.5,0,0,0,0,0.1875,0.17399999999999999,0,0,0,0,0,0,0,0,0,5.62,0,11.4,0,0.88200000000000001,0.91500000000000004,0.70499999999999996,0.86,0.39,0.63600000000000001,0.52,0.57199999999999995,0,0.92900000000000005,0.1875,1.05,0,0,0,0,0,0,0,0]
["HSS2-1/2X1X1/8","HSS","F",2.6195257499837168,0.72399999999999998,0,2.5,0,0,1,0,0,0,0,0.125,0.11600000000000001,0,0,0,0,0,0,0,0,0,5.62,0,18.600000000000001,0,0.503,0.53200000000000003,0.40300000000000002,0.83399999999999996,0.115,0.27400000000000002,0.23,0.39900000000000002,0,0.32200000000000001,0.125,0.48299999999999998,0,0,0,0,0,0,0,0]
["HSS2-1/2X1X3/16","HSS","F",3.6680330763522528,1.02,0,2.5,0,0,1,0,0,0,0,0.1875,0.17399999999999999,0,0,0,0,0,0,0,0,0,2.75,0,11.4,0,0.64600000000000002,0.71299999999999997,0.51700000000000002,0.79600000000000004,0.14299999999999999,0.36,0.28499999999999998,0.374,0,0.41199999999999998,0.1875,0.64800000000000002,0,0,0,0,0,0,0,0]
["HSS2-1/2X2-1/2X1/4","HSS","F",7.0766268586734888,1.97,0,2.5,0,0,2.5,0,0,0,0,0.25,0.23300000000000001,0,0,0,0,0,0,0,0,0,7.73,0,7.73,0,1.63,1.63,1.3,0.90800000000000003,0,0,0,0,0,2.79,0,2.35,0,0,0,0,0,0,0,0]
["HSS2-1/2X2-1/2X1/8","HSS","F",3.8955674166503838,1.07,0,2.5,0,0,2.5,0,0,0,0,0.125,0.11600000000000001,0,0,0,0,0,0,0,0,0,18.600000000000001,0,18.600000000000001,0,0.998,0.94699999999999995,0.79900000000000004,0.96499999999999997,0,0,0,0,0,1.61,0,1.31,0,0,0,0,0,0,0,0]
["HSS2-1/2X2-1/2X3/16","HSS","F",5.5749225207966964,1.54,0,2.5,0,0,2.5,0,0,0,0,0.1875,0.17399999999999999,0,0,0,0,0,0,0,0,0,11.4,0,11.4,0,1.35,1.32,1.08,0.93700000000000006,0,0,0,0,0,2.25,0,1.86,0,0,0,0,0,0,0,0]
["HSS2-1/2X2-1/2X5/16","HSS","F",8.3983945487708098,2.35,0,2.5,0,0,2.5,0,0,0,0,0.3125,0.29099999999999998,0,0,0,0,0,0,0,0,0,5.59,0,5.59,0,1.82,1.88,1.46,0.88,0,0,0,0,0,3.2,0,2.74,0,0,0,0,0,0,0,0]
["HSS2-1/2X2X1/4","HSS","F",6.2259324142290442,1.74,0,2.5,0,0,2,0,0,0,0,0.25,0.23300000000000001,0,0,0,0,0,0,0,0,0,5.58,0,7.73,0,1.33,1.37,1.06,0.874,0.93,1.17,0.93,0.73099999999999998,0,1.9,0.25,1.82,0,0,0,0,0,0,0,0]
["HSS2-1/2X2X1/8","HSS","F",3.4702201944281614,0.95599999999999996,0,2.5,0,0,2,0,0,0,0,0.125,0.11600000000000001,0,0,0,0,0,0,0,0,0,14.2,0,18.600000000000001,0,0.83299999999999996,0.80900000000000005,0.66700000000000004,0.93400000000000005,0.58899999999999997,0.69399999999999995,0.58899999999999997,0.78500000000000003,0,1.1200000000000001,0.125,1.04,0,0,0,0,0,0,0,0]
["HSS2-1/2X2X3/16","HSS","F",4.9474775207966966,1.37,0,2.5,0,0,2,0,0,0,0,0.1875,0.17399999999999999,0,0,0,0,0,0,0,0,0,8.49,0,11.4,0,1.1200000000000001,1.1200000000000001,0.89400000000000002,0.90400000000000003,0.78600000000000003,0.95599999999999996,0.78600000000000003,0.75800000000000001,0,1.55,0.1875,1.46,0,0,0,0,0,0,0,0]
["HSS2-1/4X2-1/4X1/4","HSS","F",6.2259324142290442,1.74,0,2.25,0,0,2.25,0,0,0,0,0.25,0.23300000000000001,0,0,0,0,0,0,0,0,0,6.66,0,6.66,0,1.1299999999999999,1.28,1.01,0.80600000000000005,0,0,0,0,0,1.96,0,1.85,0,0,0,0,0,0,0,0]
["HSS2-1/4X2-1/4X1/8","HSS","F",3.4702201944281614,0.95599999999999996,0,2.25,0,0,2.25,0,0,0,0,0.125,0.11600000000000001,0,0,0,0,0,0,0,0,0,16.399999999999999,0,16.399999999999999,0,0.71199999999999997,0.755,0.63300000000000001,0.86299999999999999,0,0,0,0,0,1.1499999999999999,0,1.05,0,0,0,0,0,0,0,0]
["HSS2-1/4X2-1/4X3/16","HSS","F",4.9369016874633633,1.37,0,2.25,0,0,2.25,0,0,0,0,0.1875,0.17399999999999999,0,0,0,0,0,0,0,0,0,9.93,0,9.93,0,0.95299999999999996,1.04,0.84699999999999998,0.83499999999999996,0,0,0,0,0,1.6,0,1.48,0,0,0,0,0,0,0,0]
["HSS2-1/4X2X1/8","HSS","F",3.2575465833170503,0.89800000000000002,0,2.25,0,0,2.25,0,0,0,0,0.125,0.11600000000000001,0,0,0,0,0,0,0,0,0,14.2,0,16.399999999999999,0,0.64600000000000002,0.69299999999999995,0.57399999999999995,0.84799999999999998,0.53800000000000003,0.63900000000000001,0.53800000000000003,0.77400000000000002,0,0.95699999999999996,0.125,0.92700000000000005,0,0,0,0,0,0,0,0]
["HSS2-1/4X2X3/16","HSS","F",4.6276164096855856,1.28,0,2.25,0,0,2.25,0,0,0,0,0.1875,0.17399999999999999,0,0,0,0,0,0,0,0,0,8.49,0,9.93,0,0.85899999999999999,0.95199999999999996,0.76400000000000001,0.81899999999999995,0.71299999999999997,0.877,0.71299999999999997,0.747,0,1.32,0.1875,1.3,0,0,0,0,0,0,0,0]
["HSS2X1-1/2X3/16","HSS","F",3.6680330763522528,1.02,0,2,0,0,1.5,0,0,0,0,0.1875,0.17399999999999999,0,0,0,0,0,0,0,0,0,5.62,0,8.49,0,0.495,0.63900000000000001,0.495,0.69699999999999995,0.313,0.52100000000000002,0.41699999999999998,0.55400000000000005,0,0.66400000000000003,0.1875,0.82199999999999995,0,0,0,0,0,0,0,0]
["HSS2X1X1/8","HSS","F",2.1941785277614949,0.60799999999999998,0,2,0,0,1,0,0,0,0,0.125,0.11600000000000001,0,0,0,0,0,0,0,0,0,5.62,0,14.2,0,0.28000000000000003,0.36599999999999999,0.28000000000000003,0.67900000000000005,9.2200000000000004E-2,0.223,0.184,0.39,0,0.23799999999999999,0.125,0.38,0,0,0,0,0,0,0,0]
["HSS2X1X3/16","HSS","F",3.0283108541300297,0.84499999999999997,0,2,0,0,1,0,0,0,0,0.1875,0.17399999999999999,0,0,0,0,0,0,0,0,0,2.75,0,8.49,0,0.35,0.48,0.35,0.64300000000000002,0.112,0.28799999999999998,0.22500000000000001,0.36499999999999999,0,0.30099999999999999,0.1875,0.505,0,0,0,0,0,0,0,0]
["HSS2X2X1/4","HSS","F",5.3752379697845996,1.51,0,2,0,0,2,0,0,0,0,0.25,0.23300000000000001,0,0,0,0,0,0,0,0,0,5.58,0,5.58,0,0.747,0.96399999999999997,0.747,0.70399999999999996,0,0,0,0,0,1.31,0,1.41,0,0,0,0,0,0,0,0]
["HSS2X2X1/8","HSS","F",3.0448729722059391,0.84,0,2,0,0,2,0,0,0,0,0.125,0.11600000000000001,0,0,0,0,0,0,0,0,0,14.2,0,14.2,0,0.48599999999999999,0.58399999999999996,0.48599999999999999,0.76100000000000001,0,0,0,0,0,0.79600000000000004,0,0.81699999999999995,0,0,0,0,0,0,0,0]
["HSS2X2X1/8","HSS","F",2.6195257499837168,0.72399999999999998,0,2,0,0,2,0,0,0,0,0.125,0.11600000000000001,0,0,0,0,0,0,0,0,0,9.93,0,14.2,0,0.38300000000000001,0.47499999999999998,0.38300000000000001,0.72799999999999998,0.24399999999999999,0.38900000000000001,0.32500000000000001,0.58099999999999996,0,0.496,0.125,0.59899999999999998,0,0,0,0,0,0,0,0]
["HSS2X2X3/16","HSS","F",4.2988808541300294,1.19,0,2,0,0,2,0,0,0,0,0.1875,0.17399999999999999,0,0,0,0,0,0,0,0,0,8.49,0,8.49,0,0.64100000000000001,0.79700000000000004,0.64100000000000001,0.73299999999999998,0,0,0,0,0,1.0900000000000001,0,1.1399999999999999,0,0,0,0,0,0,0,0]
["HSS3.500X0.125","HSS","F",4.5099035163837851,1.23,0,0,3.5,0,0,0,0,0,0,0.125,0.11600000000000001,0,0,0,0,0,0,0,0,0,0,0,0,30.2,1.77,1.33,1.01,1.2,1.77,1.33,1.01,1.2,0,3.53,0,2.02,0,0,0,0,0,0,0,0]
["HSS3.500X0.188","HSS","F",6.6562808507199067,1.82,0,0,3.5,0,0,0,0,0,0,1.8749999999999999E-2,0.17399999999999999,0,0,0,0,0,0,0,0,0,0,0,0,20.100000000000001,2.52,1.93,1.44,1.18,2.52,1.93,1.44,1.18,0,5.04,0,2.88,0,0,0,0,0,0,0,0]
["HSS3.500X0.203","HSS","F",7.154815607428791,1.97,0,0,3.5,0,0,0,0,0,0,0.20300000000000001,0.189,0,0,0,0,0,0,0,0,0,0,0,0,18.5,2.7,2.0699999999999998,1.54,1.17,2.7,2.0699999999999998,1.54,1.17,0,5.41,0,3.09,0,0,0,0,0,0,0,0]
["HSS3.500X0.216","HSS","F",7.5829878516758242,2.08,0,0,3.5,0,0,0,0,0,0,0.216,0.20100000000000001,0,0,0,0,0,0,0,0,0,0,0,0,17.399999999999999,2.84,2.19,1.63,1.17,2.84,2.19,1.63,1.17,0,5.69,0,3.25,0,0,0,0,0,0,0,0]
["HSS3.500X0.250","HSS","F",8.6857401056280317,2.39,0,0,3.5,0,0,0,0,0,0,0.25,0.23300000000000001,0,0,0,0,0,0,0,0,0,0,0,0,15,3.21,2.4900000000000002,1.83,1.1599999999999999,3.21,2.4900000000000002,1.83,1.1599999999999999,0,6.41,0,3.66,0,0,0,0,0,0,0,0]
["HSS3.500X0.300","HSS","F",10.262536001726657,2.82,0,0,3.5,0,0,0,0,0,0,0.3,0.27900000000000003,0,0,0,0,0,0,0,0,0,0,0,0,12.5,3.69,2.9,2.11,1.1399999999999999,3.69,2.9,2.11,1.1399999999999999,0,7.38,0,4.22,0,0,0,0,0,0,0,0]
["HSS3.500X0.313","HSS","F",10.663747708685825,2.93,0,0,3.5,0,0,0,0,0,0,0.313,0.29099999999999998,0,0,0,0,0,0,0,0,0,0,0,0,12,3.81,3,2.1800000000000002,1.1399999999999999,3.81,3,2.1800000000000002,1.1399999999999999,0,7.61,0,4.3499999999999996,0,0,0,0,0,0,0,0]
["HSS3-1/2X1-1/2X1/4","HSS","F",7.0766268586734888,1.97,0,3.5,0,0,1.5,0,0,0,0,0.25,0.23300000000000001,0,0,0,0,0,0,0,0,0,3.44,0,12,0,2.5499999999999998,1.98,1.46,1.1399999999999999,0.63800000000000001,1.06,0.85099999999999998,0.56899999999999995,0,1.79,0.25,1.88,0,0,0,0,0,0,0,0]
["HSS3-1/2X1-1/2X1/8","HSS","F",3.8955674166503838,1.07,0,3.5,0,0,1.5,0,0,0,0,0.125,0.11600000000000001,0,0,0,0,0,0,0,0,0,9.93,0,27.2,0,1.57,1.1499999999999999,0.89600000000000002,1.21,0.41099999999999998,0.63,0.54800000000000004,0.61899999999999999,0,1.0900000000000001,0.125,1.08,0,0,0,0,0,0,0,0]
["HSS3-1/2X1-1/2X3/16","HSS","F",5.5871997430189184,1.54,0,3.5,0,0,1.5,0,0,0,0,0.1875,0.17399999999999999,0,0,0,0,0,0,0,0,0,5.62,0,17.100000000000001,0,2.12,1.6,1.21,1.17,0.54400000000000004,0.86699999999999999,0.72499999999999998,0.59399999999999997,0,1.49,0.1875,1.51,0,0,0,0,0,0,0,0]
["HSS3-1/2X2X1/4","HSS","F",7.9273213031179326,2.21,0,3.5,0,0,2,0,0,0,0,0.25,0.23300000000000001,0,0,0,0,0,0,0,0,0,5.58,0,12,0,3.17,2.36,1.81,1.2,1.3,1.58,1.3,0.76600000000000001,0,3.16,0.25,2.64,0,0,0,0,0,0,0,0]
["HSS3-1/2X2X1/8","HSS","F",4.3209146388726056,1.19,0,3.5,0,0,2,0,0,0,0,0.125,0.11600000000000001,0,0,0,0,0,0,0,0,0,14.2,0,27.2,0,1.9,1.34,1.0900000000000001,1.27,0.79500000000000004,0.91200000000000003,0.79500000000000004,0.81799999999999995,0,1.83,0.125,1.47,0,0,0,0,0,0,0,0]
["HSS3-1/2X2X3/16","HSS","F",6.2269219652411412,1.71,0,3.5,0,0,2,0,0,0,0,0.1875,0.17399999999999999,0,0,0,0,0,0,0,0,0,8.49,0,17.100000000000001,0,2.61,1.89,1.49,1.23,1.08,1.27,1.08,0.79200000000000004,0,2.5499999999999998,0.1875,2.09,0,0,0,0,0,0,0,0]
["HSS3-1/2X3-1/2X1/4","HSS","F",10.479404636451266,2.91,0,3.5,0,0,3.5,0,0,0,0,0.25,0.23300000000000001,0,0,0,0,0,0,0,0,0,12,0,12,0,5.04,3.5,2.88,1.32,0,0,0,0,0,8.35,0,4.92,0,0,0,0,0,0,0,0]
["HSS3-1/2X3-1/2X1/8","HSS","F",5.5969563055392726,1.54,0,3.5,0,0,3.5,0,0,0,0,0.125,0.11600000000000001,0,0,0,0,0,0,0,0,0,27.2,0,27.2,0,2.9,1.93,1.66,1.37,0,0,0,0,0,4.58,0,2.65,0,0,0,0,0,0,0,0]
["HSS3-1/2X3-1/2X3/16","HSS","F",8.1270058541300294,2.2400000000000002,0,3.5,0,0,3.5,0,0,0,0,0.1875,0.17399999999999999,0,0,0,0,0,0,0,0,0,17.100000000000001,0,17.100000000000001,0,4.05,2.76,2.31,1.35,0,0,0,0,0,6.56,0,3.83,0,0,0,0,0,0,0,0]
["HSS3-1/2X3-1/2X3/8","HSS","F",14.64537650274888,4.09,0,3.5,0,0,3.5,0,0,0,0,0.375,0.34899999999999998,0,0,0,0,0,0,0,0,0,7.03,0,7.03,0,6.49,4.6900000000000004,3.71,1.26,0,0,0,0,0,11.2,0,6.77,0,0,0,0,0,0,0,0]
["HSS3-1/2X3-1/2X5/16","HSS","F",12.651866770993035,3.52,0,3.5,0,0,3.5,0,0,0,0,0.3125,0.29099999999999998,0,0,0,0,0,0,0,0,0,9.0299999999999994,0,9.0299999999999994,0,5.84,4.1399999999999997,3.34,1.29,0,0,0,0,0,9.89,0,5.9,0,0,0,0,0,0,0,0]
["HSS3X0.125","HSS","F",3.8417696621047055,1.05,0,0,3,0,0,0,0,0,0,0.125,0.11600000000000001,0,0,0,0,0,0,0,0,0,0,0,0,25.9,1.0900000000000001,0.96499999999999997,0.73,1.02,1.0900000000000001,0.96499999999999997,0.73,1.02,0,2.19,0,1.46,0,0,0,0,0,0,0,0]
["HSS3X0.134","HSS","F",4.1054847669240715,1.1200000000000001,0,0,3,0,0,0,0,0,0,0.13400000000000001,0.124,0,0,0,0,0,0,0,0,0,0,0,0,24.2,1.1599999999999999,1.03,0.77400000000000002,1.02,1.1599999999999999,1.03,0.77400000000000002,1.02,0,2.3199999999999998,0,1.55,0,0,0,0,0,0,0,0]
["HSS3X0.152","HSS","F",4.6277195677119378,1.27,0,0,3,0,0,0,0,0,0,0.152,0.14099999999999999,0,0,0,0,0,0,0,0,0,0,0,0,21.3,1.3,1.1499999999999999,0.86499999999999999,1.01,1.3,1.1499999999999999,0.86499999999999999,1.01,0,2.59,0,1.73,0,0,0,0,0,0,0,0]
["HSS3X0.188","HSS","F",5.6514075338841723,1.54,0,0,3,0,0,0,0,0,0,0.1875,0.17399999999999999,0,0,0,0,0,0,0,0,0,0,0,0,17.2,1.55,1.39,1.03,1,1.55,1.39,1.03,1,0,3.1,0,2.06,0,0,0,0,0,0,0,0]
["HSS3X0.203","HSS","F",6.0697662280795646,1.67,0,0,3,0,0,0,0,0,0,0.20300000000000001,0.189,0,0,0,0,0,0,0,0,0,0,0,0,15.9,1.66,1.5,1.1000000000000001,0.996,1.66,1.5,1.1000000000000001,0.996,0,3.31,0,2.21,0,0,0,0,0,0,0,0]
["HSS3X0.216","HSS","F",6.4284525514815769,1.77,0,0,3,0,0,0,0,0,0,0.216,0.20100000000000001,0,0,0,0,0,0,0,0,0,0,0,0,14.9,1.74,1.58,1.1599999999999999,0.99199999999999999,1.74,1.58,1.1599999999999999,0.99199999999999999,0,3.48,0,2.3199999999999998,0,0,0,0,0,0,0,0]
["HSS3X0.250","HSS","F",7.3494723970698708,2.0299999999999998,0,0,3,0,0,0,0,0,0,0.25,0.23300000000000001,0,0,0,0,0,0,0,0,0,0,0,0,12.9,1.95,1.79,1.3,0.98199999999999998,1.95,1.79,1.3,0.98199999999999998,0,3.9,0,2.6,0,0,0,0,0,0,0,0]
["HSS3X1-1/2X1/4","HSS","F",6.2259324142290442,1.74,0,3,0,0,1.5,0,0,0,0,0.25,0.23300000000000001,0,0,0,0,0,0,0,0,0,3.44,0,9.8800000000000008,0,1.68,1.51,1.1200000000000001,0.98199999999999998,0.54300000000000004,0.91100000000000003,0.72499999999999998,0.55900000000000005,0,1.44,0.25,1.58,0,0,0,0,0,0,0,0]
["HSS3X1-1/2X1/8","HSS","F",3.4702201944281614,0.95599999999999996,0,3,0,0,1.5,0,0,0,0,125,0.11600000000000001,0,0,0,0,0,0,0,0,0,9.93,0,22.9,0,1.06,0.89500000000000002,0.70599999999999996,1.05,0.35499999999999998,0.55000000000000004,0.47399999999999998,0.61,0,0.88600000000000001,0.125,0.92,0,0,0,0,0,0,0,0]
["HSS3X1-1/2X3/16","HSS","F",4.9474775207966966,1.37,0,3,0,0,1.5,0,0,0,0,0.1875,0.17399999999999999,0,0,0,0,0,0,0,0,0,5.62,0,14.2,0,1.42,1.24,0.94499999999999995,1.02,0.46700000000000003,0.752,0.622,0.58399999999999996,0,1.21,0.1875,1.28,0,0,0,0,0,0,0,0]
["HSS3X1X1/8","HSS","F",3.0448729722059391,0.84,0,3,0,0,1,0,0,0,0,0.125,0.11600000000000001,0,0,0,0,0,0,0,0,0,5.62,0,22.9,0,0.81699999999999995,0.72799999999999998,0.54500000000000004,0.98699999999999999,0.13800000000000001,0.32500000000000001,0.27600000000000002,0.40500000000000003,0,0.40799999999999997,0.125,0.58499999999999996,0,0,0,0,0,0,0,0]
["HSS3X1X3/16","HSS","F",4.3077552985744747,1.19,0,3,0,0,1,0,0,0,0,0.1875,0.17399999999999999,0,0,0,0,0,0,0,0,0,2.75,0,14.2,0,1.07,0.98899999999999999,0.71299999999999997,0.94699999999999995,0.17299999999999999,0.432,0.34499999999999997,0.38,0,0.52600000000000002,0.1875,0.79200000000000004,0,0,0,0,0,0,0,0]
["HSS3X2-1/2X1/4","HSS","F",7.9273213031179326,2.21,0,3,0,0,2.5,0,0,0,0,0.25,0.23300000000000001,0,0,0,0,0,0,0,0,0,7.73,0,9.8800000000000008,0,2.57,2.16,1.72,1.08,1.93,1.9,1.54,0.93500000000000005,0,3.74,0.25,2.87,0,0,0,0,0,0,0,0]
["HSS3X2-1/2X1/8","HSS","F",4.3209146388726056,1.19,0,3,0,0,2.5,0,0,0,0,0.125,0.11600000000000001,0,0,0,0,0,0,0,0,0,18.600000000000001,0,22.9,0,1.54,1.23,1.03,1.1399999999999999,1.1599999999999999,1.0900000000000001,0.93100000000000005,0.99,0,2.13,0.125,1.59,0,0,0,0,0,0,0,0]
["HSS3X2-1/2X3/16","HSS","F",6.2269219652411412,1.71,0,3,0,0,2.5,0,0,0,0,0.1875,0.17399999999999999,0,0,0,0,0,0,0,0,0,11.4,0,14.2,0,2.11,1.73,1.41,1.1100000000000001,1.59,1.52,1.27,0.96299999999999997,0,3,0.1875,2.27,0,0,0,0,0,0,0,0]
["HSS3X2-1/2X5/16","HSS","F",9.4725562154374785,2.64,0,3,0,0,2.5,0,0,0,0,0.3125,0.29099999999999998,0,0,0,0,0,0,0,0,0,5.59,0,7.31,0,2.92,2.5099999999999998,1.94,1.05,2.1800000000000002,2.2000000000000002,1.74,0.90800000000000003,0,4.34,0.3125,3.39,0,0,0,0,0,0,0,0]
["HSS3X2X1/4","HSS","F",7.0766268586734888,1.97,0,3,0,0,2,0,0,0,0,0.25,0.23300000000000001,0,0,0,0,0,0,0,0,0,5.58,0,9.8800000000000008,0,2.13,1.83,1.42,1.04,1.1100000000000001,1.38,1.1100000000000001,0.751,0,2.52,0.25,2.23,0,0,0,0,0,0,0,0]
["HSS3X2X1/8","HSS","F",3.8955674166503838,1.07,0,3,0,0,2,0,0,0,0,0.125,0.11600000000000001,0,0,0,0,0,0,0,0,0,14.2,0,22.9,0,1.3,1.06,0.86699999999999999,1.1000000000000001,0.69199999999999995,0.80300000000000005,0.69199999999999995,0.80400000000000005,0,1.47,0.125,1.25,0,0,0,0,0,0,0,0]
["HSS3X2X3/16","HSS","F",5.5871997430189184,1.54,0,3,0,0,2,0,0,0,0,0.1875,0.17399999999999999,0,0,0,0,0,0,0,0,0,8.49,0,14.2,0,1.77,1.48,1.18,1.07,0.93200000000000005,1.1200000000000001,0.93200000000000005,0.77800000000000002,0,2.0499999999999998,0.1875,1.78,0,0,0,0,0,0,0,0]
["HSS3X2X5/16","HSS","F",8.4074867709930334,2.35,0,3,0,0,2,0,0,0,0,0.3125,0.29099999999999998,0,0,0,0,0,0,0,0,0,3.87,0,7.31,0,2.38,2.11,1.59,1.01,1.24,1.58,1.24,0.72499999999999998,0,2.87,0.3125,2.6,0,0,0,0,0,0,0,0]
["HSS3X3X1/4","HSS","F",8.7780157475623781,2.44,0,3,0,0,3,0,0,0,0,0.25,0.23300000000000001,0,0,0,0,0,0,0,0,0,9.8800000000000008,0,9.8800000000000008,0,3.02,2.48,2.0099999999999998,1.1100000000000001,0,0,0,0,0,5.08,0,3.52,0,0,0,0,0,0,0,0]
["HSS3X3X1/8","HSS","F",4.7462618610948279,1.3,0,3,0,0,3,0,0,0,0,0.125,0.11600000000000001,0,0,0,0,0,0,0,0,0,22.9,0,22.9,0,1.78,1.4,1.19,1.17,0,0,0,0,0,2.84,0,1.92,0,0,0,0,0,0,0,0]
["HSS3X3X3/16","HSS","F",6.8509641874633633,1.89,0,3,0,0,3,0,0,0,0,0.1875,0.17399999999999999,0,0,0,0,0,0,0,0,0,14.2,0,14.2,0,2.46,1.97,1.64,1.1399999999999999,0,0,0,0,0,4.03,0,2.76,0,0,0,0,0,0,0,0]
["HSS3X3X3/8","HSS","F",12.093293169415546,3.39,0,3,0,0,3,0,0,0,0,0.375,0.34899999999999998,0,0,0,0,0,0,0,0,0,5.6,0,5.6,0,3.78,3.25,2.52,1.06,0,0,0,0,0,6.64,0,4.74,0,0,0,0,0,0,0,0]
["HSS3X3X5/16","HSS","F",10.525130659881922,2.94,0,3,0,0,3,0,0,0,0,0.3125,0.29099999999999998,0,0,0,0,0,0,0,0,0,7.31,0,7.31,0,3.45,2.9,2.2999999999999998,1.08,0,0,0,0,0,5.94,0,4.18,0,0,0,0,0,0,0,0]
["HSS4.500X0.125","HSS","F",5.8461712249419433,1.6,0,0,4.5,0,0,0,0,0,0,0.125,0.11600000000000001,0,0,0,0,0,0,0,0,0,0,0,0,38.799999999999997,3.84,2.23,1.71,1.55,3.84,2.23,1.71,1.55,0,7.68,0,3.41,0,0,0,0,0,0,0,0]
["HSS4.500X0.188","HSS","F",8.6660274843913871,2.36,0,0,4.5,0,0,0,0,0,0,0.1875,0.17399999999999999,0,0,0,0,0,0,0,0,0,0,0,0,25.9,5.54,3.26,2.46,1.53,5.54,3.26,2.46,1.53,0,11.1,0,4.93,0,0,0,0,0,0,0,0]
["HSS4.500X0.237","HSS","F",10.80058152204219,2.96,0,0,4.5,0,0,0,0,0,0,0.23699999999999999,0.22,0,0,0,0,0,0,0,0,0,0,0,0,20.5,6.79,4.03,3.02,1.52,6.79,4.03,3.02,1.52,0,13.6,0,6.04,0,0,0,0,0,0,0,0]
["HSS4.500X0.337","HSS","F",14.997531141081645,4.12,0,0,4.5,0,0,0,0,0,0,0.33700000000000002,0.313,0,0,0,0,0,0,0,0,0,0,0,0,14.4,9.07,5.5,4.03,1.48,9.07,5.5,4.03,1.48,0,18.100000000000001,0,8.06,0,0,0,0,0,0,0,0]
["HSS4.500X0.375","HSS","F",16.536312893407214,4.55,0,0,4.5,0,0,0,0,0,0,0.375,0.34899999999999998,0,0,0,0,0,0,0,0,0,0,0,0,12.9,9.8699999999999992,6.03,4.3899999999999997,1.47,9.8699999999999992,6.03,4.3899999999999997,1.47,0,19.7,0,8.7799999999999994,0,0,0,0,0,0,0,0]
["HSS4-1/2X4-1/2X1/2","HSS","F",24.901094313458373,6.95,0,4.5,0,0,4.5,0,0,0,0,0.5,0.46500000000000002,0,0,0,0,0,0,0,0,0,6.68,0,6.68,0,18.100000000000001,10.199999999999999,8.0299999999999994,1.61,0,0,0,0,0,31.3,0,14.8,0,0,0,0,0,0,0,0]
["HSS4-1/2X4-1/2X1/4","HSS","F",13.882182414229042,3.84,0,4.5,0,0,4.5,0,0,0,0,0.25,0.23300000000000001,0,0,0,0,0,0,0,0,0,16.3,0,16.3,0,11.4,6.06,5.08,1.73,0,0,0,0,0,18.5,0,8.44,0,0,0,0,0,0,0,0]
["HSS4-1/2X4-1/2X1/8","HSS","F",7.2983451944281601,2,0,4.5,0,0,4.5,0,0,0,0,0.125,0.11600000000000001,0,0,0,0,0,0,0,0,0,35.799999999999997,0,35.799999999999997,0,6.35,3.27,2.82,1.78,0,0,0,0,0,9.92,0,4.45,0,0,0,0,0,0,0,0]
["HSS4-1/2X4-1/2X3/16","HSS","F",10.679089187463363,2.93,0,4.5,0,0,4.5,0,0,0,0,0.1875,0.17399999999999999,0,0,0,0,0,0,0,0,0,22.9,0,22.9,0,9.02,4.71,4.01,1.75,0,0,0,0,0,14.4,0,6.49,0,0,0,0,0,0,0,0]
["HSS4-1/2X4-1/2X3/8","HSS","F",19.749543169415549,5.48,0,4.5,0,0,4.5,0,0,0,0,0.375,0.34899999999999998,0,0,0,0,0,0,0,0,0,9.89,0,9.89,0,15.3,8.36,6.79,1.67,0,0,0,0,0,25.7,0,11.9,0,0,0,0,0,0,0,0]
["HSS4-1/2X4-1/2X5/16","HSS","F",16.905338993215253,4.68,0,4.5,0,0,4.5,0,0,0,0,0.3125,0.29099999999999998,0,0,0,0,0,0,0,0,0,12.5,0,12.5,0,13.5,7.27,6,1.7,0,0,0,0,0,22.3,0,10.199999999999999,0,0,0,0,0,0,0,0]
["HSS4X0.125","HSS","F",5.1780373706628637,1.42,0,0,4,0,0,0,0,0,0,0.125,0.11600000000000001,0,0,0,0,0,0,0,0,0,0,0,0,34.5,2.67,1.75,1.34,1.37,2.67,1.75,1.34,1.37,0,5.34,0,2.67,0,0,0,0,0,0,0,0]
["HSS4X0.188","HSS","F",7.6611541675556438,2.09,0,0,4,0,0,0,0,0,0,0.1875,0.17399999999999999,0,0,0,0,0,0,0,0,0,0,0,0,23,3.83,2.5499999999999998,1.92,1.35,3.83,2.5499999999999998,1.92,1.35,0,7.67,0,3.83,0,0,0,0,0,0,0,0]
["HSS4X0.220","HSS","F",8.8899218114957161,2.44,0,0,4,0,0,0,0,0,0,0.22,0.20499999999999999,0,0,0,0,0,0,0,0,0,0,0,0,19.5,4.41,2.96,2.21,1.34,4.41,2.96,2.21,1.34,0,8.83,0,4.41,0,0,0,0,0,0,0,0]
["HSS4X0.226","HSS","F",9.1178783924340685,2.5,0,0,4,0,0,0,0,0,0,0.22600000000000001,0.21,0,0,0,0,0,0,0,0,0,0,0,0,19,4.5,3.02,2.25,1.34,4.5,3.02,2.25,1.34,0,9.01,0,4.5,0,0,0,0,0,0,0,0]
["HSS4X0.237","HSS","F",9.533799734329051,2.61,0,0,4,0,0,0,0,0,0,0.23699999999999999,0.22,0,0,0,0,0,0,0,0,0,0,0,0,18.2,4.68,3.15,2.34,1.34,4.68,3.15,2.34,1.34,0,9.36,0,4.68,0,0,0,0,0,0,0,0]
["HSS4X0.250","HSS","F",10,2.76,0,0,4,0,0,0,0,0,0,0.25,0.23300000000000001,0,0,0,0,0,0,0,0,0,0,0,0,17.2,4.91,3.31,2.4500000000000002,1.33,4.91,3.31,2.4500000000000002,1.33,0,9.82,0,4.91,0,0,0,0,0,0,0,0]
["HSS4X0.313","HSS","F",12.336754879800639,3.39,0,0,4,0,0,0,0,0,0,0.3125,0.29099999999999998,0,0,0,0,0,0,0,0,0,0,0,0,13.7,5.87,4.01,2.93,1.32,5.87,4.01,2.93,1.32,0,11.7,0,5.87,0,0,0,0,0,0,0,0]
["HSS4X2-1/2X1/4","HSS","F",9.628710192006821,2.67,0,4,0,0,2.5,0,0,0,0,0.25,0.23300000000000001,0,0,0,0,0,0,0,0,0,7.73,0,14.2,0,5.32,3.38,2.66,1.41,2.5299999999999998,2.4300000000000002,2.02,0.97299999999999998,0,5.78,0.25,3.93,0,0,0,0,0,0,0,0]
["HSS4X2-1/2X1/8","HSS","F",5.1716090833170503,1.42,0,4,0,0,2.5,0,0,0,0,0.125,0.11600000000000001,0,0,0,0,0,0,0,0,0,18.600000000000001,0,31.5,0,3.09,1.88,1.54,1.47,1.49,1.36,1.19,1.03,0,3.23,0.125,2.14,0,0,0,0,0,0,0,0]
["HSS4X2-1/2X3/16","HSS","F",7.5063664096855867,2.06,0,4,0,0,2.5,0,0,0,0,0.1875,0.17399999999999999,0,0,0,0,0,0,0,0,0,11.4,0,20,0,4.3,2.67,2.15,1.44,2.06,1.93,1.65,0.999,0,4.59,0.1875,3.08,0,0,0,0,0,0,0,0]
["HSS4X2-1/2X3/8","HSS","F",13.369334836082214,3.74,0,4,0,0,2.5,0,0,0,0,0.375,0.34899999999999998,0,0,0,0,0,0,0,0,0,4.16,0,8.4600000000000009,0,6.77,4.4800000000000004,3.38,1.35,3.17,3.2,2.54,0.92200000000000004,0,7.57,0.375,5.32,0,0,0,0,0,0,0,0]
["HSS4X2-1/2X5/16","HSS","F",11.602695104326369,3.23,0,4,0,0,2.5,0,0,0,0,0.3125,0.29099999999999998,0,0,0,0,0,0,0,0,0,5.59,0,10.7,0,6.13,3.97,3.07,1.38,2.89,2.85,2.3199999999999998,0.94699999999999995,0,6.77,0.3125,4.67,0,0,0,0,0,0,0,0]
["HSS4X2X1/4","HSS","F",8.7780157475623781,2.44,0,4,0,0,2,0,0,0,0,0.25,0.23300000000000001,0,0,0,0,0,0,0,0,0,5.58,0,14.2,0,4.49,2.94,2.25,1.36,1.48,1.79,1.48,0.77900000000000003,0,3.82,0.25,3.05,0,0,0,0,0,0,0,0]
["HSS4X2X1/8","HSS","F",4.7462618610948279,1.3,0,4,0,0,2,0,0,0,0,0.125,0.11600000000000001,0,0,0,0,0,0,0,0,0,14.2,0,31.5,0,2.65,1.66,1.32,1.43,0.89800000000000002,1.02,0.89800000000000002,0.83,0,2.2000000000000002,0.125,1.69,0,0,0,0,0,0,0,0]
["HSS4X2X3/16","HSS","F",6.8666441874633639,1.89,0,4,0,0,2,0,0,0,0,0.1875,0.17399999999999999,0,0,0,0,0,0,0,0,0,8.49,0,20,0,3.66,2.34,1.83,1.39,1.22,1.43,1.22,0.80400000000000005,0,3.08,0.1875,2.41,0,0,0,0,0,0,0,0]
["HSS4X2X3/8","HSS","F",12.093293169415546,3.39,0,4,0,0,2,0,0,0,0,0.375,0.34899999999999998,0,0,0,0,0,0,0,0,0,2.73,0,8.4600000000000009,0,5.6,3.84,2.8,1.29,1.8,2.31,1.8,0.72899999999999998,0,4.83,0.375,4.04,0,0,0,0,0,0,0,0]
["HSS4X2X5/16","HSS","F",10.537625659881924,2.94,0,4,0,0,2,0,0,0,0,0.3125,0.29099999999999998,0,0,0,0,0,0,0,0,0,3.87,0,10.7,0,5.13,3.43,2.56,1.32,1.67,2.08,1.67,0.754,0,4.4000000000000004,0.3125,3.59,0,0,0,0,0,0,0,0]
["HSS4X3X1/4","HSS","F",10.479404636451266,2.91,0,4,0,0,3,0,0,0,0,0.25,0.23300000000000001,0,0,0,0,0,0,0,0,0,9.8800000000000008,0,14.2,0,6.15,3.81,3.07,1.45,3.91,3.12,2.61,1.1599999999999999,0,7.96,0.25,4.8099999999999996,0,0,0,0,0,0,0,0]
["HSS4X3X1/8","HSS","F",5.5969563055392726,1.54,0,4,0,0,3,0,0,0,0,0.125,0.11600000000000001,0,0,0,0,0,0,0,0,0,22.9,0,31.5,0,3.52,2.11,1.76,1.52,2.27,1.73,1.51,1.21,0,4.38,0.125,2.59,0,0,0,0,0,0,0,0]
["HSS4X3X3/16","HSS","F",8.1460886319078085,2.2400000000000002,0,4,0,0,3,0,0,0,0,0.1875,0.17399999999999999,0,0,0,0,0,0,0,0,0,14.2,0,20,0,4.93,3,2.4700000000000002,1.49,3.16,2.46,2.1,1.19,0,6.26,0.1875,3.74,0,0,0,0,0,0,0,0]
["HSS4X3X3/8","HSS","F",14.64537650274888,4.09,0,4,0,0,3,0,0,0,0,0.375,0.34899999999999998,0,0,0,0,0,0,0,0,0,5.6,0,8.4600000000000009,0,7.93,5.12,3.97,1.39,5.01,4.18,3.34,1.1100000000000001,0,10.6,0.375,6.59,0,0,0,0,0,0,0,0]
["HSS4X3X5/16","HSS","F",12.667764548770812,3.52,0,4,0,0,3,0,0,0,0,0.3125,0.29099999999999998,0,0,0,0,0,0,0,0,0,7.31,0,10.7,0,7.14,4.51,3.57,1.42,4.5199999999999996,3.69,3.02,1.1299999999999999,0,9.41,0.3125,5.75,0,0,0,0,0,0,0,0]
["HSS4X4X1/2","HSS","F",21.498316535680594,6.02,0,4,0,0,4,0,0,0,0,0.5,0.46500000000000002,0,0,0,0,0,0,0,0,0,5.6,0,5.6,0,11.9,7.7,5.97,1.41,0,0,0,0,0,21,0,11.2,0,0,0,0,0,0,0,0]
["HSS4X4X1/4","HSS","F",12.180793525340155,3.37,0,4,0,0,4,0,0,0,0,0.25,0.23300000000000001,0,0,0,0,0,0,0,0,0,14.2,0,14.2,0,7.8,4.6900000000000004,3.9,1.52,0,0,0,0,0,12.8,0,6.56,0,0,0,0,0,0,0,0]
["HSS4X4X1/8","HSS","F",6.4476507499837172,1.77,0,4,0,0,4,0,0,0,0,0.125,0.11600000000000001,0,0,0,0,0,0,0,0,0,31.5,0,31.5,0,4.4000000000000004,2.56,2.2000000000000002,1.58,0,0,0,0,0,6.91,0,3.49,0,0,0,0,0,0,0,0]
["HSS4X4X3/16","HSS","F",9.4030475207966973,2.58,0,4,0,0,4,0,0,0,0,0.1875,0.17399999999999999,0,0,0,0,0,0,0,0,0,20,0,20,0,6.21,3.67,3.1,1.55,0,0,0,0,0,10,0,5.07,0,0,0,0,0,0,0,0]
["HSS4X4X3/8","HSS","F",17.197459836082214,4.78,0,4,0,0,4,0,0,0,0,0.375,0.34899999999999998,0,0,0,0,0,0,0,0,0,8.4600000000000009,0,8.4600000000000009,0,10.3,6.39,5.13,1.47,0,0,0,0,0,17.5,0,9.14,0,0,0,0,0,0,0,0]
["HSS4X4X5/16","HSS","F",14.778602882104146,4.0999999999999996,0,4,0,0,4,0,0,0,0,0.3125,0.29099999999999998,0,0,0,0,0,0,0,0,0,10.7,0,10.7,0,9.14,5.59,4.57,1.49,0,0,0,0,0,15.3,0,7.91,0,0,0,0,0,0,0,0]
["HSS5.500X0.258","HSS","F",14.457732437532494,3.97,0,0,5.5,0,0,0,0,0,0,0.25800000000000001,0.24,0,0,0,0,0,0,0,0,0,0,0,0,22.9,13.7,6.64,5,1.86,13.7,6.64,5,1.86,0,27.5,0,10,0,0,0,0,0,0,0,0]
["HSS5.500X0.375","HSS","F",20.545116019081686,5.65,0,0,5.5,0,0,0,0,0,0,0.375,0.34899999999999998,0,0,0,0,0,0,0,0,0,0,0,0,15.8,18.8,9.27,6.84,1.83,18.8,9.27,6.84,1.83,0,37.6,0,13.7,0,0,0,0,0,0,0,0]
["HSS5.500X0.500","HSS","F",26.725354171163168,7.36,0,0,5.5,0,0,0,0,0,0,0.5,0.46500000000000002,0,0,0,0,0,0,0,0,0,0,0,0,11.8,23.5,11.8,8.5500000000000007,1.79,23.5,11.8,8.5500000000000007,1.79,0,47,0,17.100000000000001,0,0,0,0,0,0,0,0]
["HSS5.563X0.134","HSS","F",7.7769284018251126,2.12,0,0,5.5629999999999997,0,0,0,0,0,0,0.13400000000000001,0.124,0,0,0,0,0,0,0,0,0,0,0,0,44.9,7.84,3.67,2.82,1.92,7.84,3.67,2.82,1.92,0,15.7,0,5.64,0,0,0,0,0,0,0,0]
["HSS5.563X0.188","HSS","F",10.802388155984158,2.95,0,0,5.5629999999999997,0,0,0,0,0,0,0.1875,0.17399999999999999,0,0,0,0,0,0,0,0,0,0,0,0,32,10.7,5.05,3.85,1.91,10.7,5.05,3.85,1.91,0,21.4,0,7.7,0,0,0,0,0,0,0,0]
["HSS5.563X0.258","HSS","F",14.631490000211729,4.01,0,0,5.5629999999999997,0,0,0,0,0,0,0.25800000000000001,0.24,0,0,0,0,0,0,0,0,0,0,0,0,23.2,14.2,6.8,5.12,1.88,14.2,6.8,5.12,1.88,0,28.5,0,10.199999999999999,0,0,0,0,0,0,0,0]
["HSS5.563X0.375","HSS","F",20.797670615999177,5.72,0,0,5.5629999999999997,0,0,0,0,0,0,0.375,0.34899999999999998,0,0,0,0,0,0,0,0,0,0,0,0,15.9,19.5,9.5,7.02,1.85,19.5,9.5,7.02,1.85,0,39,0,14,0,0,0,0,0,0,0,0]
["HSS5.563X0.500","HSS","F",27.062093633719819,7.45,0,0,5.5629999999999997,0,0,0,0,0,0,0.5,0.46500000000000002,0,0,0,0,0,0,0,0,0,0,0,0,12,24.4,12.1,8.77,1.81,24.4,12.1,8.77,1.81,0,48.8,0,17.5,0,0,0,0,0,0,0,0]
["HSS5-1/2X5-1/2X1/4","HSS","F",17.284960192006821,4.7699999999999996,0,5.5,0,0,5.5,0,0,0,0,0.25,0.23300000000000001,0,0,0,0,0,0,0,0,0,20.6,0,20.6,0,21.7,9.32,7.9,2.13,0,0,0,0,0,34.799999999999997,0,12.9,0,0,0,0,0,0,0,0]
["HSS5-1/2X5-1/2X1/8","HSS","F",8.9997340833170494,2.46,0,5.5,0,0,5.5,0,0,0,0,0.125,0.11600000000000001,0,0,0,0,0,0,0,0,0,44.4,0,44.4,0,11.8,4.95,4.3,2.19,0,0,0,0,0,18.3,0,6.72,0,0,0,0,0,0,0,0]
["HSS5-1/2X5-1/2X3/16","HSS","F",13.231172520796697,3.63,0,5.5,0,0,5.5,0,0,0,0,0.1875,0.17399999999999999,0,0,0,0,0,0,0,0,0,28.6,0,28.6,0,17,7.19,6.17,2.16,0,0,0,0,0,26.7,0,9.85,0,0,0,0,0,0,0,0]
["HSS5-1/2X5-1/2X3/8","HSS","F",24.853709836082217,6.88,0,5.5,0,0,5.5,0,0,0,0,0.375,0.34899999999999998,0,0,0,0,0,0,0,0,0,12.8,0,12.8,0,29.7,13.1,10.8,2.08,0,0,0,0,0,49,0,18.399999999999999,0,0,0,0,0,0,0,0]
["HSS5-1/2X5-1/2X5/16","HSS","F",21.158811215437474,5.85,0,5.5,0,0,5.5,0,0,0,0,0.3125,0.29099999999999998,0,0,0,0,0,0,0,0,0,15.9,0,15.9,0,25.9,11.3,9.43,2.11,0,0,0,0,0,42.2,0,15.7,0,0,0,0,0,0,0,0]
["HSS5X0.125","HSS","F",6.5143050792210229,1.78,0,0,5,0,0,0,0,0,0,0.125,0.11600000000000001,0,0,0,0,0,0,0,0,0,0,0,0,43.1,5.31,2.77,2.12,1.73,5.31,2.77,2.12,1.73,0,10.6,0,4.25,0,0,0,0,0,0,0,0]
["HSS5X0.188","HSS","F",9.6709008012271269,2.64,0,0,5,0,0,0,0,0,0,0.1875,0.17399999999999999,0,0,0,0,0,0,0,0,0,0,0,0,28.7,7.69,4.05,3.08,1.71,7.69,4.05,3.08,1.71,0,15.4,0,6.15,0,0,0,0,0,0,0,0]
["HSS5X0.250","HSS","F",12.694543231302506,3.49,0,0,5,0,0,0,0,0,0,0.25,0.23300000000000001,0,0,0,0,0,0,0,0,0,0,0,0,21.5,9.94,5.3,3.97,1.69,9.94,5.3,3.97,1.69,0,19.899999999999999,0,7.95,0,0,0,0,0,0,0,0]
["HSS5X0.258","HSS","F",13.078704162300477,3.59,0,0,5,0,0,0,0,0,0,0.25800000000000001,0.24,0,0,0,0,0,0,0,0,0,0,0,0,20.8,10.199999999999999,5.44,4.08,1.69,10.199999999999999,5.44,4.08,1.69,0,20.399999999999999,0,8.15,0,0,0,0,0,0,0,0]
["HSS5X0.312","HSS","F",15.635999852230725,4.3,0,0,5,0,0,0,0,0,0,0.3125,0.29099999999999998,0,0,0,0,0,0,0,0,0,0,0,0,17.2,12,6.46,4.79,1.67,12,6.46,4.79,1.67,0,24,0,9.58,0,0,0,0,0,0,0,0]
["HSS5X0.375","HSS","F",18.540714456244448,5.0999999999999996,0,0,5,0,0,0,0,0,0,0.375,0.34899999999999998,0,0,0,0,0,0,0,0,0,0,0,0,14.3,13.9,7.56,5.55,1.65,13.9,7.56,5.55,1.65,0,27.7,0,11.1,0,0,0,0,0,0,0,0]
["HSS5X0.500","HSS","F",24.052818754046854,6.62,0,0,5,0,0,0,0,0,0,0.5,0.46500000000000002,0,0,0,0,0,0,0,0,0,0,0,0,10.8,17.2,9.6,6.88,1.61,17.2,9.6,6.88,1.61,0,34.4,0,13.8,0,0,0,0,0,0,0,0]
["HSS5X2-1/2X1/4","HSS","F",11.33009908089571,3.14,0,5,0,0,2.5,0,0,0,0,0.25,0.23300000000000001,0,0,0,0,0,0,0,0,0,7.73,0,18.5,0,9.4,4.83,3.76,1.73,3.13,2.95,2.5,0.999,0,7.93,0.25,4.99,0,0,0,0,0,0,0,0]
["HSS5X2-1/2X1/8","HSS","F",6.0223035277614949,1.65,0,5,0,0,2.5,0,0,0,0,0.125,0.11600000000000001,0,0,0,0,0,0,0,0,0,18.600000000000001,0,40.1,0,5.34,2.65,2.14,1.8,1.82,1.64,1.46,1.05,0,4.4000000000000004,0.125,2.7,0,0,0,0,0,0,0,0]
["HSS5X2-1/2X3/16","HSS","F",8.7858108541300304,2.41,0,5,0,0,2.5,0,0,0,0,0.1875,0.17399999999999999,0,0,0,0,0,0,0,0,0,11.4,0,25.7,0,7.51,3.79,3.01,1.77,2.5299999999999998,2.33,2.0299999999999998,1.02,0,6.26,0.1875,3.89,0,0,0,0,0,0,0,0]
["HSS5X2X1/4","HSS","F",10.479404636451266,2.91,0,5,0,0,2,0,0,0,0,0.25,0.23300000000000001,0,0,0,0,0,0,0,0,0,5.58,0,18.5,0,8.08,4.2699999999999996,3.23,1.67,1.84,2.2000000000000002,1.84,0.79700000000000004,0,5.17,0.25,3.88,0,0,0,0,0,0,0,0]
["HSS5X2X1/8","HSS","F",5.5969563055392726,1.54,0,5,0,0,2,0,0,0,0,0.125,0.11600000000000001,0,0,0,0,0,0,0,0,0,14.2,0,40.1,0,4.6500000000000004,2.37,1.86,1.74,1.1000000000000001,1.24,1.1000000000000001,0.84799999999999998,0,2.95,0.125,2.13,0,0,0,0,0,0,0,0]
["HSS5X2X3/16","HSS","F",8.1460886319078085,2.2400000000000002,0,5,0,0,2,0,0,0,0,0.1875,0.17399999999999999,0,0,0,0,0,0,0,0,0,8.49,0,25.7,0,6.5,3.37,2.6,1.7,1.51,1.75,1.51,0.82299999999999995,0,4.1500000000000004,0.1875,3.05,0,0,0,0,0,0,0,0]
["HSS5X2X3/8","HSS","F",14.64537650274888,4.09,0,5,0,0,2,0,0,0,0,0.375,0.34899999999999998,0,0,0,0,0,0,0,0,0,2.73,0,11.3,0,10.4,5.71,4.1399999999999997,1.59,2.2799999999999998,2.88,2.2799999999999998,0.748,0,6.61,0.375,5.2,0,0,0,0,0,0,0,0]
["HSS5X2X5/16","HSS","F",12.667764548770812,3.52,0,5,0,0,2,0,0,0,0,0.3125,0.29099999999999998,0,0,0,0,0,0,0,0,0,3.87,0,14.2,0,9.35,5.05,3.74,1.63,2.1,2.57,2.1,0.77200000000000002,0,5.99,0.3125,4.59,0,0,0,0,0,0,0,0]
["HSS5X3X1/2","HSS","F",21.498316535680594,6.02,0,5,0,0,3,0,0,0,0,0.5,0.46500000000000002,0,0,0,0,0,0,0,0,0,3.45,0,7.75,0,16.399999999999999,8.83,6.57,1.65,7.18,6.1,4.78,1.0900000000000001,0,17.600000000000001,0.5,10.3,0,0,0,0,0,0,0,0]
["HSS5X3X1/4","HSS","F",12.180793525340155,3.37,0,5,0,0,3,0,0,0,0,0.25,0.23300000000000001,0,0,0,0,0,0,0,0,0,9.8800000000000008,0,18.5,0,10.7,5.38,4.29,1.78,4.8099999999999996,3.77,3.21,1.19,0,11,0.25,6.1,0,0,0,0,0,0,0,0]
["HSS5X3X1/8","HSS","F",6.4476507499837172,1.77,0,5,0,0,3,0,0,0,0,0.125,0.11600000000000001,0,0,0,0,0,0,0,0,0,22.9,0,40.1,0,6.03,2.93,2.41,1.85,2.75,2.0699999999999998,1.83,1.25,0,6.02,0.125,3.26,0,0,0,0,0,0,0,0]
["HSS5X3X3/16","HSS","F",9.4255330763522522,2.58,0,5,0,0,3,0,0,0,0,0.1875,0.17399999999999999,0,0,0,0,0,0,0,0,0,14.2,0,25.7,0,8.5299999999999994,4.21,3.41,1.82,3.85,2.96,2.57,1.22,0,8.64,0.1875,4.7300000000000004,0,0,0,0,0,0,0,0]
["HSS5X3X3/8","HSS","F",17.197459836082214,4.78,0,5,0,0,3,0,0,0,0,0.375,0.34899999999999998,0,0,0,0,0,0,0,0,0,5.6,0,11.3,0,14.1,7.34,5.65,1.72,6.25,5.0999999999999996,4.16,1.1399999999999999,0,14.9,0.375,8.44,0,0,0,0,0,0,0,0]
["HSS5X3X5/16","HSS","F",14.7979034376597,4.0999999999999996,0,5,0,0,3,0,0,0,0,0.3125,0.29099999999999998,0,0,0,0,0,0,0,0,0,7.31,0,14.2,0,12.6,6.42,5.03,1.75,5.6,4.4800000000000004,3.73,1.17,0,13.1,0.3125,7.33,0,0,0,0,0,0,0,0]
["HSS5X4X1/2","HSS","F",24.901094313458373,6.95,0,5,0,0,4,0,0,0,0,0.5,0.46500000000000002,0,0,0,0,0,0,0,0,0,5.6,0,7.75,0,21.2,10.9,8.49,1.75,14.9,9.35,7.43,1.46,0,30.3,0.5,14.5,0,0,0,0,0,0,0,0]
["HSS5X4X1/4","HSS","F",13.882182414229042,3.84,0,5,0,0,4,0,0,0,0,0.25,0.23300000000000001,0,0,0,0,0,0,0,0,0,14.2,0,18.5,0,13.4,6.49,5.35,1.87,9.4600000000000009,5.57,4.7300000000000004,1.57,0,18,0.25,8.32,0,0,0,0,0,0,0,0]
["HSS5X4X1/8","HSS","F",7.2983451944281601,2,0,5,0,0,4,0,0,0,0,0.125,0.11600000000000001,0,0,0,0,0,0,0,0,0,31.5,0,40.1,0,7.42,3.5,2.97,1.93,5.27,3.01,2.64,1.62,0,9.66,0.125,4.3899999999999997,0,0,0,0,0,0,0,0]
["HSS5X4X3/16","HSS","F",10.704977520796696,2.93,0,5,0,0,4,0,0,0,0,0.1875,0.17399999999999999,0,0,0,0,0,0,0,0,0,20,0,25.7,0,10.6,5.05,4.22,1.9,7.48,4.34,3.74,1.6,0,14,0.1875,6.41,0,0,0,0,0,0,0,0]
["HSS5X4X3/8","HSS","F",19.749543169415549,5.48,0,5,0,0,4,0,0,0,0,0.375,0.34899999999999998,0,0,0,0,0,0,0,0,0,8.4600000000000009,0,11.3,0,17.899999999999999,8.9600000000000009,7.17,1.81,12.6,7.67,6.3,1.52,0,24.9,0.375,11.7,0,0,0,0,0,0,0,0]
["HSS5X4X5/16","HSS","F",16.928042326548585,4.68,0,5,0,0,4,0,0,0,0,0.3125,0.29099999999999998,0,0,0,0,0,0,0,0,0,10.7,0,14.2,0,15.8,7.79,6.32,1.84,11.1,6.67,5.57,1.54,0,21.7,0.3125,10.1,0,0,0,0,0,0,0,0]
["HSS5X5X1/2","HSS","F",28.303872091236148,7.88,0,5,0,0,5,0,0,0,0,0.5,0.46500000000000002,0,0,0,0,0,0,0,0,0,7.75,0,7.75,0,26,13.1,10.4,1.82,0,0,0,0,0,44.6,0,18.7,0,0,0,0,0,0,0,0]
["HSS5X5X1/4","HSS","F",15.583571303117932,4.3,0,5,0,0,5,0,0,0,0,0.25,0.23300000000000001,0,0,0,0,0,0,0,0,0,18.5,0,18.5,0,16,7.61,6.41,1.93,0,0,0,0,0,25.8,0,10.5,0,0,0,0,0,0,0,0]
["HSS5X5X1/8","HSS","F",8.1490396388726047,2.23,0,5,0,0,5,0,0,0,0,0.125,0.11600000000000001,0,0,0,0,0,0,0,0,0,40.1,0,40.1,0,8.8000000000000007,4.07,3.52,1.99,0,0,0,0,0,13.7,0,5.53,0,0,0,0,0,0,0,0]
["HSS5X5X3/16","HSS","F",11.955130854130029,3.28,0,5,0,0,5,0,0,0,0,0.1875,0.17399999999999999,0,0,0,0,0,0,0,0,0,25.7,0,25.7,0,12.6,5.89,5.03,1.96,0,0,0,0,0,19.899999999999999,0,8.08,0,0,0,0,0,0,0,0]
["HSS5X5X3/8","HSS","F",22.301626502748881,6.18,0,5,0,0,5,0,0,0,0,0.375,0.34899999999999998,0,0,0,0,0,0,0,0,0,11.3,0,11.3,0,21.7,10.6,8.68,1.87,0,0,0,0,0,36.1,0,14.9,0,0,0,0,0,0,0,0]
["HSS5X5X5/16","HSS","F",19.032075104326363,5.26,0,5,0,0,5,0,0,0,0,0.3125,0.29099999999999998,0,0,0,0,0,0,0,0,0,14.2,0,14.2,0,19,9.16,7.62,1.9,0,0,0,0,0,31.2,0,12.8,0,0,0,0,0,0,0,0]
["HSS6.625X0.125","HSS","F",8.6857401056280317,2.37,0,0,6.625,0,0,0,0,0,0,0.125,0.11600000000000001,0,0,0,0,0,0,0,0,0,0,0,0,57.1,12.6,4.92,3.79,2.2999999999999998,12.6,4.92,3.79,2.2999999999999998,0,25.1,0,7.59,0,0,0,0,0,0,0,0]
["HSS6.625X0.188","HSS","F",12.936739080943269,3.53,0,0,6.625,0,0,0,0,0,0,0.1875,0.17399999999999999,0,0,0,0,0,0,0,0,0,0,0,0,38.1,18.399999999999999,7.24,5.54,2.2799999999999998,18.399999999999999,7.24,5.54,2.2799999999999998,0,36.700000000000003,0,11.1,0,0,0,0,0,0,0,0]
["HSS6.625X0.250","HSS","F",17.037413284116521,4.68,0,0,6.625,0,0,0,0,0,0,0.25,0.23300000000000001,0,0,0,0,0,0,0,0,0,0,0,0,28.4,23.9,9.52,7.22,2.2599999999999998,23.9,9.52,7.22,2.2599999999999998,0,47.9,0,14.4,0,0,0,0,0,0,0,0]
["HSS6.625X0.280","HSS","F",18.992105688195416,5.2,0,0,6.625,0,0,0,0,0,0,0.28000000000000003,0.26,0,0,0,0,0,0,0,0,0,0,0,0,25.5,26.4,10.5,7.96,2.25,26.4,10.5,7.96,2.25,0,52.7,0,15.9,0,0,0,0,0,0,0,0]
["HSS6.625X0.312","HSS","F",21.055901678142611,5.79,0,0,6.625,0,0,0,0,0,0,0.3125,0.29099999999999998,0,0,0,0,0,0,0,0,0,0,0,0,22.8,29.1,11.7,8.7899999999999991,2.2400000000000002,29.1,11.7,8.7899999999999991,2.2400000000000002,0,58.2,0,17.600000000000001,0,0,0,0,0,0,0,0]
["HSS6.625X0.375","HSS","F",25.055019535465473,6.88,0,0,6.625,0,0,0,0,0,0,0.375,0.34899999999999998,0,0,0,0,0,0,0,0,0,0,0,0,19,34,13.8,10.3,2.2200000000000002,34,13.8,10.3,2.2200000000000002,0,68,0,20.5,0,0,0,0,0,0,0,0]
["HSS6.625X0.432","HSS","F",28.600148456411937,7.86,0,0,6.625,0,0,0,0,0,0,0.4375,0.40200000000000002,0,0,0,0,0,0,0,0,0,0,0,0,16.5,38.200000000000003,15.6,11.5,2.2000000000000002,38.200000000000003,15.6,11.5,2.2000000000000002,0,76.400000000000006,0,23.1,0,0,0,0,0,0,0,0]
["HSS6.625X0.500","HSS","F",32.738558859674882,9,0,0,6.625,0,0,0,0,0,0,0.5,0.46500000000000002,0,0,0,0,0,0,0,0,0,0,0,0,14.2,42.9,17.7,13,2.1800000000000002,42.9,17.7,13,2.1800000000000002,0,85.9,0,25.9,0,0,0,0,0,0,0,0]
["HSS6.875X0.188","HSS","F",13.439175739361144,3.66,0,0,6.875,0,0,0,0,0,0,0.1875,0.17399999999999999,0,0,0,0,0,0,0,0,0,0,0,0,39.5,20.6,7.81,5.99,2.37,20.6,7.81,5.99,2.37,0,41.1,0,12,0,0,0,0,0,0,0,0]
["HSS6.875X0.250","HSS","F",17.705547138395602,4.8600000000000003,0,0,6.875,0,0,0,0,0,0,0.25,0.23300000000000001,0,0,0,0,0,0,0,0,0,0,0,0,29.5,26.8,10.3,7.81,2.35,26.8,10.3,7.81,2.35,0,53.7,0,15.6,0,0,0,0,0,0,0,0]
["HSS6.875X0.312","HSS","F",21.889732728282898,6.02,0,0,6.875,0,0,0,0,0,0,0.3125,0.29099999999999998,0,0,0,0,0,0,0,0,0,0,0,0,23.6,32.700000000000003,12.6,9.51,2.33,32.700000000000003,12.6,9.51,2.33,0,65.400000000000006,0,19,0,0,0,0,0,0,0,0]
["HSS6.875X0.375","HSS","F",26.057220316884091,7.16,0,0,6.875,0,0,0,0,0,0,0.375,0.34899999999999998,0,0,0,0,0,0,0,0,0,0,0,0,19.7,38.200000000000003,14.9,11.1,2.31,38.200000000000003,14.9,11.1,2.31,0,76.400000000000006,0,22.2,0,0,0,0,0,0,0,0]
["HSS6.875X0.500","HSS","F",34.074826568233043,9.36,0,0,6.875,0,0,0,0,0,0,0.5,0.46500000000000002,0,0,0,0,0,0,0,0,0,0,0,0,14.8,48.3,19.100000000000001,14.1,2.27,48.3,19.100000000000001,14.1,2.27,0,96.7,0,28.1,0,0,0,0,0,0,0,0]
["HSS6X0.125","HSS","F",7.850572787779182,2.14,0,0,6,0,0,0,0,0,0,0.125,0.11600000000000001,0,0,0,0,0,0,0,0,0,0,0,0,51.7,9.2799999999999994,4.0199999999999996,3.09,2.08,9.2799999999999994,4.0199999999999996,3.09,2.08,0,18.600000000000001,0,6.19,0,0,0,0,0,0,0,0]
["HSS6X0.188","HSS","F",11.680647434898594,3.18,0,0,6,0,0,0,0,0,0,0.1875,0.17399999999999999,0,0,0,0,0,0,0,0,0,0,0,0,34.5,13.5,5.91,4.51,2.06,13.5,5.91,4.51,2.06,0,27,0,9.02,0,0,0,0,0,0,0,0]
["HSS6X0.250","HSS","F",15.367078648418822,4.22,0,0,6,0,0,0,0,0,0,0.25,0.23300000000000001,0,0,0,0,0,0,0,0,0,0,0,0,25.8,17.600000000000001,7.75,5.86,2.04,17.600000000000001,7.75,5.86,2.04,0,35.200000000000003,0,11.7,0,0,0,0,0,0,0,0]
["HSS6X0.280","HSS","F",17.121330896213987,4.6900000000000004,0,0,6,0,0,0,0,0,0,0.28000000000000003,0.26,0,0,0,0,0,0,0,0,0,0,0,0,23.1,19.3,8.57,6.45,2.0299999999999998,19.3,8.57,6.45,2.0299999999999998,0,38.700000000000003,0,12.9,0,0,0,0,0,0,0,0]
["HSS6X0.312","HSS","F",18.971324052791889,5.22,0,0,6,0,0,0,0,0,0,0.3125,0.29099999999999998,0,0,0,0,0,0,0,0,0,0,0,0,20.6,21.3,9.49,7.11,2.02,21.3,9.49,7.11,2.02,0,42.6,0,14.2,0,0,0,0,0,0,0,0]
["HSS6X0.375","HSS","F",22.549517581918924,6.2,0,0,6,0,0,0,0,0,0,0.375,0.34899999999999998,0,0,0,0,0,0,0,0,0,0,0,0,17.2,24.8,11.2,8.2799999999999994,2,24.8,11.2,8.2799999999999994,2,0,49.7,0,16.600000000000001,0,0,0,0,0,0,0,0]
["HSS6X0.500","HSS","F",29.397889588279483,8.09,0,0,6,0,0,0,0,0,0,0.5,0.46500000000000002,0,0,0,0,0,0,0,0,0,0,0,0,12.9,31.2,14.3,10.4,1.96,31.2,14.3,10.4,1.96,0,62.4,0,20.8,0,0,0,0,0,0,0,0]
["HSS6X2X1/4","HSS","F",12.180793525340155,3.37,0,6,0,0,2,0,0,0,0,0.25,0.23300000000000001,0,0,0,0,0,0,0,0,0,5.58,0,22.8,0,13.1,5.84,4.37,1.97,2.21,2.61,2.21,0.81,0,6.55,0.25,4.7,0,0,0,0,0,0,0,0]
["HSS6X2X1/8","HSS","F",6.4476507499837172,1.77,0,6,0,0,2,0,0,0,0,0.125,0.11600000000000001,0,0,0,0,0,0,0,0,0,14.2,0,48.7,0,7.42,3.19,2.4700000000000002,2.0499999999999998,1.31,1.46,1.31,0.86099999999999999,0,3.72,0.125,2.57,0,0,0,0,0,0,0,0]
["HSS6X2X3/16","HSS","F",9.4255330763522522,2.58,0,6,0,0,2,0,0,0,0,0.1875,0.17399999999999999,0,0,0,0,0,0,0,0,0,8.49,0,31.5,0,10.5,4.58,3.49,2.0099999999999998,1.8,2.0699999999999998,1.8,0.83599999999999997,0,5.24,0.1875,3.68,0,0,0,0,0,0,0,0]
["HSS6X2X3/8","HSS","F",17.197459836082214,4.78,0,6,0,0,2,0,0,0,0,0.375,0.34899999999999998,0,0,0,0,0,0,0,0,0,2.73,0,14.2,0,17.100000000000001,7.93,5.71,1.89,2.77,3.46,2.77,0.76,0,8.42,0.375,6.35,0,0,0,0,0,0,0,0]
["HSS6X2X5/16","HSS","F",14.7979034376597,4.0999999999999996,0,6,0,0,2,0,0,0,0,0.3125,0.29099999999999998,0,0,0,0,0,0,0,0,0,3.87,0,17.600000000000001,0,15.3,6.95,5.1100000000000003,1.93,2.52,3.07,2.52,0.78500000000000003,0,7.6,0.3125,5.58,0,0,0,0,0,0,0,0]
["HSS6X3X1/2","HSS","F",24.901094313458373,6.95,0,6,0,0,3,0,0,0,0,0.5,0.46500000000000002,0,0,0,0,0,0,0,0,0,3.45,0,9.9,0,26.8,12.1,8.9499999999999993,1.97,8.69,7.28,5.79,1.1200000000000001,0,23.1,0.5,12.7,0,0,0,0,0,0,0,0]
["HSS6X3X1/4","HSS","F",13.882182414229042,3.84,0,6,0,0,3,0,0,0,0,0.25,0.23300000000000001,0,0,0,0,0,0,0,0,0,9.8800000000000008,0,22.8,0,17,7.19,5.66,2.1,5.7,4.41,3.8,1.22,0,14.2,0.25,7.39,0,0,0,0,0,0,0,0]
["HSS6X3X1/8","HSS","F",7.2983451944281601,2,0,6,0,0,3,0,0,0,0,0.125,0.11600000000000001,0,0,0,0,0,0,0,0,0,22.9,0,48.7,0,9.43,3.87,3.14,2.17,3.23,2.4,2.15,1.27,0,7.73,0.125,3.93,0,0,0,0,0,0,0,0]
["HSS6X3X3/16","HSS","F",10.704977520796696,2.93,0,6,0,0,3,0,0,0,0,0.1875,0.17399999999999999,0,0,0,0,0,0,0,0,0,14.2,0,31.5,0,13.4,5.59,4.47,2.14,4.55,3.45,3.03,1.25,0,11.1,0.1875,5.71,0,0,0,0,0,0,0,0]
["HSS6X3X3/8","HSS","F",19.749543169415549,5.48,0,6,0,0,3,0,0,0,0,0.375,0.34899999999999998,0,0,0,0,0,0,0,0,0,5.6,0,14.2,0,22.7,9.9,7.57,2.04,7.48,6.03,4.99,1.17,0,19.3,0.375,10.3,0,0,0,0,0,0,0,0]
["HSS6X3X5/16","HSS","F",16.928042326548585,4.68,0,6,0,0,3,0,0,0,0,0.3125,0.29099999999999998,0,0,0,0,0,0,0,0,0,7.31,0,17.600000000000001,0,20.100000000000001,8.61,6.69,2.0699999999999998,6.67,5.27,4.45,1.19,0,16.899999999999999,0.3125,8.91,0,0,0,0,0,0,0,0]
["HSS6X4X1/2","HSS","F",28.303872091236148,7.88,0,6,0,0,4,0,0,0,0,0.5,0.46500000000000002,0,0,0,0,0,0,0,0,0,5.6,0,9.9,0,34,14.6,11.3,2.08,17.8,11,8.89,1.5,0,40.299999999999997,0.5,17.8,0,0,0,0,0,0,0,0]
["HSS6X4X1/4","HSS","F",15.583571303117932,4.3,0,6,0,0,4,0,0,0,0,0.25,0.23300000000000001,0,0,0,0,0,0,0,0,0,14.2,0,22.8,0,20.9,8.5299999999999994,6.96,2.2000000000000002,11.1,6.45,5.56,1.61,0,23.6,0.25,10.1,0,0,0,0,0,0,0,0]
["HSS6X4X1/8","HSS","F",8.1490396388726047,2.23,0,6,0,0,4,0,0,0,0,0.125,0.11600000000000001,0,0,0,0,0,0,0,0,0,31.5,0,48.7,0,11.4,4.5599999999999996,3.81,2.2599999999999998,6.15,3.46,3.08,1.66,0,12.6,0.125,5.3,0,0,0,0,0,0,0,0]
["HSS6X4X3/16","HSS","F",11.984421965241141,3.28,0,6,0,0,4,0,0,0,0,0.1875,0.17399999999999999,0,0,0,0,0,0,0,0,0,20,0,31.5,0,16.399999999999999,6.6,5.46,2.23,8.76,5,4.38,1.63,0,18.2,0.1875,7.74,0,0,0,0,0,0,0,0]
["HSS6X4X3/8","HSS","F",22.301626502748881,6.18,0,6,0,0,4,0,0,0,0,0.375,0.34899999999999998,0,0,0,0,0,0,0,0,0,8.4600000000000009,0,14.2,0,28.3,11.9,9.43,2.14,14.9,8.94,7.47,1.55,0,32.799999999999997,0.375,14.2,0,0,0,0,0,0,0,0]
["HSS6X4X5/16","HSS","F",19.058181215437475,5.26,0,6,0,0,4,0,0,0,0,0.3125,0.29099999999999998,0,0,0,0,0,0,0,0,0,10.7,0,17.600000000000001,0,24.8,10.3,8.27,2.17,13.2,7.75,6.58,1.58,0,28.4,0.3125,12.2,0,0,0,0,0,0,0,0]
["HSS6X5X1/2","HSS","F",31.706649869013926,8.81,0,6,0,0,5,0,0,0,0,0.5,0.46500000000000002,0,0,0,0,0,0,0,0,0,7.75,0,9.9,0,41.1,17.2,13.7,2.16,30.8,15.2,12.3,1.87,0,59.8,0.5,23,0,0,0,0,0,0,0,0]
["HSS6X5X1/4","HSS","F",17.284960192006821,4.7699999999999996,0,6,0,0,5,0,0,0,0,0.25,0.23300000000000001,0,0,0,0,0,0,0,0,0,18.5,0,22.8,0,24.7,9.8699999999999992,8.25,2.2799999999999998,18.7,8.7200000000000006,7.47,1.98,0,34.200000000000003,0.25,12.8,0,0,0,0,0,0,0,0]
["HSS6X5X1/8","HSS","F",8.9997340833170494,2.46,0,6,0,0,5,0,0,0,0,0.125,0.11600000000000001,0,0,0,0,0,0,0,0,0,40.1,0,48.7,0,13.4,5.24,4.4800000000000004,2.34,10.199999999999999,4.63,4.07,2.0299999999999998,0,18,0.125,6.66,0,0,0,0,0,0,0,0]
["HSS6X5X3/16","HSS","F",13.263866409685585,3.63,0,6,0,0,5,0,0,0,0,0.1875,0.17399999999999999,0,0,0,0,0,0,0,0,0,25.7,0,31.5,0,19.3,7.62,6.44,2.31,14.6,6.73,5.84,2.0099999999999998,0,26.3,0.1875,9.76,0,0,0,0,0,0,0,0]
["HSS6X5X3/8","HSS","F",24.853709836082217,6.88,0,6,0,0,5,0,0,0,0,0.375,0.34899999999999998,0,0,0,0,0,0,0,0,0,11.3,0,14.2,0,33.9,13.8,11.3,2.2200000000000002,25.5,12.2,10.199999999999999,1.92,0,48.1,0.375,18.2,0,0,0,0,0,0,0,0]
["HSS6X5X5/16","HSS","F",21.188320104326365,5.85,0,6,0,0,5,0,0,0,0,0.3125,0.29099999999999998,0,0,0,0,0,0,0,0,0,14.2,0,17.600000000000001,0,29.6,11.9,9.85,2.25,22.3,10.5,8.91,1.95,0,41.4,0.3125,15.6,0,0,0,0,0,0,0,0]
["HSS6X6X1/2","HSS","F",35.109427646791701,9.74,0,6,0,0,6,0,0,0,0,0.5,0.46500000000000002,0,0,0,0,0,0,0,0,0,9.9,0,9.9,0,48.3,19.8,16.100000000000001,2.23,0,0,0,0,0,81.099999999999994,0,28.1,0,0,0,0,0,0,0,0]
["HSS6X6X1/4","HSS","F",18.98634908089571,5.24,0,6,0,0,6,0,0,0,0,0.25,0.23300000000000001,0,0,0,0,0,0,0,0,0,22.8,0,22.8,0,28.6,11.2,9.5399999999999991,2.34,0,0,0,0,0,45.6,0,15.4,0,0,0,0,0,0,0,0]
["HSS6X6X1/8","HSS","F",9.850428527761494,2.7,0,6,0,0,6,0,0,0,0,0.125,0.11600000000000001,0,0,0,0,0,0,0,0,0,48.7,0,48.7,0,15.5,5.92,5.15,2.39,0,0,0,0,0,23.9,0,8.0299999999999994,0,0,0,0,0,0,0,0]
["HSS6X6X3/16","HSS","F",14.507214187463363,3.98,0,6,0,0,6,0,0,0,0,0.1875,0.17399999999999999,0,0,0,0,0,0,0,0,0,31.5,0,31.5,0,22.3,8.6300000000000008,7.42,2.37,0,0,0,0,0,35,0,11.8,0,0,0,0,0,0,0,0]
["HSS6X6X3/8","HSS","F",27.405793169415549,7.58,0,6,0,0,6,0,0,0,0,0.375,0.34899999999999998,0,0,0,0,0,0,0,0,0,14.2,0,14.2,0,39.5,15.8,13.2,2.2799999999999998,0,0,0,0,0,64.599999999999994,0,22.1,0,0,0,0,0,0,0,0]
["HSS6X6X5/16","HSS","F",23.285547326548585,6.43,0,6,0,0,6,0,0,0,0,0.3125,0.29099999999999998,0,0,0,0,0,0,0,0,0,17.600000000000001,0,17.600000000000001,0,34.299999999999997,13.6,11.4,2.31,0,0,0,0,0,55.4,0,18.899999999999999,0,0,0,0,0,0,0,0]
["HSS6X6X5/8","HSS","F",42.097252513024195,11.7,0,6,0,0,6,0,0,0,0,0.625,0.58099999999999996,0,0,0,0,0,0,0,0,0,7.33,0,7.33,0,55.2,23.2,18.399999999999999,2.17,0,0,0,0,0,94.9,0,33.4,0,0,0,0,0,0,0,0]
["HSS7.500X0.188","HSS","F",14.695267385405808,4,0,0,7.5,0,0,0,0,0,0,0.1875,0.17399999999999999,0,0,0,0,0,0,0,0,0,0,0,0,43.1,26.9,9.34,7.17,2.59,26.9,9.34,7.17,2.59,0,53.8,0,14.3,0,0,0,0,0,0,0,0]
["HSS7.500X0.250","HSS","F",19.375881774093298,5.32,0,0,7.5,0,0,0,0,0,0,0.25,0.23300000000000001,0,0,0,0,0,0,0,0,0,0,0,0,32.200000000000003,35.200000000000003,12.3,9.3699999999999992,2.57,35.200000000000003,12.3,9.3699999999999992,2.57,0,70.3,0,18.7,0,0,0,0,0,0,0,0]
["HSS7.500X0.312","HSS","F",23.974310353633626,6.59,0,0,7.5,0,0,0,0,0,0,0.3125,0.29099999999999998,0,0,0,0,0,0,0,0,0,0,0,0,25.8,42.9,15.1,11.4,2.5499999999999998,42.9,15.1,11.4,2.5499999999999998,0,85.8,0,22.9,0,0,0,0,0,0,0,0]
["HSS7.500X0.375","HSS","F",28.562722270430637,7.84,0,0,7.5,0,0,0,0,0,0,0.375,0.34899999999999998,0,0,0,0,0,0,0,0,0,0,0,0,21.5,50.2,17.899999999999999,13.4,2.5299999999999998,50.2,17.899999999999999,13.4,2.5299999999999998,0,100,0,26.8,0,0,0,0,0,0,0,0]
["HSS7.500X0.500","HSS","F",37.415495839628434,10.3,0,0,7.5,0,0,0,0,0,0,0.5,0.46500000000000002,0,0,0,0,0,0,0,0,0,0,0,0,16.100000000000001,63.9,23,17,2.4900000000000002,63.9,23,17,2.4900000000000002,0,128,0,34.1,0,0,0,0,0,0,0,0]
["HSS7.625X0.328","HSS","F",25.585956111571452,7.01,0,0,8.625,0,0,0,0,0,0,0.32800000000000001,0.30499999999999999,0,0,0,0,0,0,0,0,0,0,0,0,25,47.1,16.399999999999999,12.3,2.59,47.1,16.399999999999999,12.3,2.59,0,94.1,0,24.7,0,0,0,0,0,0,0,0]
["HSS7.625X0.375","HSS","F",29.063822661139945,7.98,0,0,8.625,0,0,0,0,0,0,0.375,0.34899999999999998,0,0,0,0,0,0,0,0,0,0,0,0,21.8,52.9,18.5,13.9,2.58,52.9,18.5,13.9,2.58,0,106,0,27.8,0,0,0,0,0,0,0,0]
["HSS7X0.125","HSS","F",9.1868404963373393,2.5099999999999998,0,0,7,0,0,0,0,0,0,0.125,0.11600000000000001,0,0,0,0,0,0,0,0,0,0,0,0,60.3,14.9,5.5,4.25,2.4300000000000002,14.9,5.5,4.25,2.4300000000000002,0,29.7,0,8.49,0,0,0,0,0,0,0,0]
["HSS7X0.188","HSS","F",13.690394068570063,3.73,0,0,7,0,0,0,0,0,0,0.1875,0.17399999999999999,0,0,0,0,0,0,0,0,0,0,0,0,40.200000000000003,21.7,8.11,6.21,2.41,21.7,8.11,6.21,2.41,0,43.5,0,12.4,0,0,0,0,0,0,0,0]
["HSS7X0.250","HSS","F",18.03961406553514,4.95,0,0,7,0,0,0,0,0,0,0.25,0.23300000000000001,0,0,0,0,0,0,0,0,0,0,0,0,30,28.4,10.7,8.11,2.39,28.4,10.7,8.11,2.39,0,56.8,0,16.2,0,0,0,0,0,0,0,0]
["HSS7X0.312","HSS","F",22.306648253353057,6.13,0,0,7,0,0,0,0,0,0,0.3125,0.29099999999999998,0,0,0,0,0,0,0,0,0,0,0,0,24.1,34.6,13.1,9.8800000000000008,2.37,34.6,13.1,9.8800000000000008,2.37,0,69.099999999999994,0,19.8,0,0,0,0,0,0,0,0]
["HSS7X0.375","HSS","F",26.558320707593399,7.29,0,0,7,0,0,0,0,0,0,0.375,0.34899999999999998,0,0,0,0,0,0,0,0,0,0,0,0,20.100000000000001,40.4,15.5,11.6,2.35,40.4,15.5,11.6,2.35,0,80.900000000000006,0,23.1,0,0,0,0,0,0,0,0]
["HSS7X0.500","HSS","F",34.742960422512127,9.5500000000000007,0,0,7,0,0,0,0,0,0,0.5,0.46500000000000002,0,0,0,0,0,0,0,0,0,0,0,0,15.1,51.2,19.899999999999999,14.6,2.3199999999999998,51.2,19.899999999999999,14.6,2.3199999999999998,0,102,0,29.3,0,0,0,0,0,0,0,0]
["HSS7X2X1/2","HSS","F",13.882182414229042,3.84,0,7,0,0,2,0,0,0,0,0.5,0.23300000000000001,0,0,0,0,0,0,0,0,0,5.58,0,27,0,19.8,7.64,5.67,2.27,2.58,3.02,2.58,0.81899999999999995,0,7.95,0.5,5.52,0,0,0,0,0,0,0,0]
["HSS7X2X1/4","HSS","F",7.2983451944281601,2,0,7,0,0,2,0,0,0,0,0.125,0.11600000000000001,0,0,0,0,0,0,0,0,0,14.2,0,57.3,0,11.1,4.13,3.16,2.35,1.52,1.68,1.52,0.871,0,4.51,0.125,3,0,0,0,0,0,0,0,0]
["HSS7X2X3/16","HSS","F",10.704977520796696,2.93,0,7,0,0,2,0,0,0,0,0.1875,0.17399999999999999,0,0,0,0,0,0,0,0,0,8.49,0,37.200000000000003,0,15.7,5.95,4.49,2.31,2.1,2.39,2.1,0.84499999999999997,0,6.35,0.1875,4.32,0,0,0,0,0,0,0,0]
["HSS7X3X1/2","HSS","F",28.303872091236148,7.88,0,7,0,0,3,0,0,0,0,0.5,0.46500000000000002,0,0,0,0,0,0,0,0,0,3.45,0,12.1,0,40.700000000000003,15.8,11.6,2.27,10.199999999999999,8.4600000000000009,6.8,1.1399999999999999,0,28.6,0.5,15,0,0,0,0,0,0,0,0]
["HSS7X3X1/4","HSS","F",15.583571303117932,4.3,0,7,0,0,3,0,0,0,0,0.25,0.23300000000000001,0,0,0,0,0,0,0,0,0,9.8800000000000008,0,27,0,25.2,9.2200000000000006,7.19,2.42,6.6,5.0599999999999996,4.4000000000000004,1.24,0,17.5,0.25,8.68,0,0,0,0,0,0,0,0]
["HSS7X3X1/8","HSS","F",8.1490396388726047,2.23,0,7,0,0,3,0,0,0,0,0.125,0.11600000000000001,0,0,0,0,0,0,0,0,0,22.9,0,57.3,0,13.8,4.93,3.95,2.4900000000000002,3.71,2.73,2.48,1.29,0,9.48,0.125,4.5999999999999996,0,0,0,0,0,0,0,0]
["HSS7X3X3/16","HSS","F",11.984421965241141,3.28,0,7,0,0,3,0,0,0,0,0.1875,0.17399999999999999,0,0,0,0,0,0,0,0,0,14.2,0,37.200000000000003,0,19.8,7.14,5.65,2.4500000000000002,5.24,3.94,3.5,1.26,0,13.7,0.1875,6.69,0,0,0,0,0,0,0,0]
["HSS7X3X3/8","HSS","F",22.301626502748881,6.18,0,7,0,0,3,0,0,0,0,0.375,0.34899999999999998,0,0,0,0,0,0,0,0,0,5.6,0,17.100000000000001,0,34.1,12.8,9.73,2.35,8.7100000000000009,6.95,5.81,1.19,0,23.9,0.375,12.1,0,0,0,0,0,0,0,0]
["HSS7X3X5/16","HSS","F",19.058181215437475,5.26,0,7,0,0,3,0,0,0,0,0.3125,0.29099999999999998,0,0,0,0,0,0,0,0,0,7.31,0,21.1,0,29.9,11.1,8.5399999999999991,2.38,7.74,6.05,5.16,1.21,0,20.9,0.3125,10.5,0,0,0,0,0,0,0,0]
["HSS7X4X1/2","HSS","F",31.706649869013926,8.81,0,7,0,0,4,0,0,0,0,0.5,0.46500000000000002,0,0,0,0,0,0,0,0,0,5.6,0,12.1,0,50.7,18.8,14.5,2.4,20.7,12.6,10.4,1.53,0,50.5,0.5,21.1,0,0,0,0,0,0,0,0]
["HSS7X4X1/4","HSS","F",17.284960192006821,4.7699999999999996,0,7,0,0,4,0,0,0,0,0.25,0.23300000000000001,0,0,0,0,0,0,0,0,0,14.2,0,27,0,30.5,10.8,8.7200000000000006,2.5299999999999998,12.8,7.33,6.38,1.64,0,29.3,0.25,11.8,0,0,0,0,0,0,0,0]
["HSS7X4X1/8","HSS","F",8.9997340833170494,2.46,0,7,0,0,4,0,0,0,0,0.125,0.11600000000000001,0,0,0,0,0,0,0,0,0,31.5,0,57.3,0,16.600000000000001,5.73,4.7300000000000004,2.59,7.03,3.91,3.51,1.69,0,15.6,0.125,6.2,0,0,0,0,0,0,0,0]
["HSS7X4X3/16","HSS","F",13.263866409685585,3.63,0,7,0,0,4,0,0,0,0,0.1875,0.17399999999999999,0,0,0,0,0,0,0,0,0,20,0,37.200000000000003,0,23.8,8.33,6.81,2.56,10,5.67,5.0199999999999996,1.66,0,22.7,0.1875,9.07,0,0,0,0,0,0,0,0]
["HSS7X4X3/8","HSS","F",24.853709836082217,6.88,0,7,0,0,4,0,0,0,0,0.375,0.34899999999999998,0,0,0,0,0,0,0,0,0,8.4600000000000009,0,17.100000000000001,0,41.8,15.1,11.9,2.46,17.3,10.199999999999999,8.6300000000000008,1.58,0,41,0.375,16.8,0,0,0,0,0,0,0,0]
["HSS7X4X5/16","HSS","F",21.188320104326365,5.85,0,7,0,0,4,0,0,0,0,0.3125,0.29099999999999998,0,0,0,0,0,0,0,0,0,10.7,0,21.1,0,36.5,13.1,10.4,2.5,15.2,8.83,7.58,1.61,0,35.4,0.3125,14.4,0,0,0,0,0,0,0,0]
["HSS7X5X1/2","HSS","F",35.109427646791701,9.74,0,7,0,0,5,0,0,0,0,0.5,0.46500000000000002,0,0,0,0,0,0,0,0,0,7.75,0,12.1,0,60.6,21.9,17.3,2.5,35.6,17.3,14.2,1.91,0,75.8,0.5,27.2,0,0,0,0,0,0,0,0]
["HSS7X5X1/4","HSS","F",18.98634908089571,5.24,0,7,0,0,5,0,0,0,0,0.25,0.23300000000000001,0,0,0,0,0,0,0,0,0,18.5,0,27,0,35.9,12.4,10.199999999999999,2.62,21.3,9.83,8.5299999999999994,2.02,0,42.9,0.25,15,0,0,0,0,0,0,0,0]
["HSS7X5X1/8","HSS","F",9.850428527761494,2.7,0,7,0,0,5,0,0,0,0,0.125,0.11600000000000001,0,0,0,0,0,0,0,0,0,40.1,0,57.3,0,19.3,6.53,5.52,2.68,11.6,5.2,4.63,2.0699999999999998,0,22.5,0.125,7.79,0,0,0,0,0,0,0,0]
["HSS7X5X3/16","HSS","F",14.543310854130031,3.98,0,7,0,0,5,0,0,0,0,0.1875,0.17399999999999999,0,0,0,0,0,0,0,0,0,25.7,0,37.200000000000003,0,27.9,9.52,7.96,2.65,16.600000000000001,7.57,6.65,2.0499999999999998,0,32.9,0.1875,11.4,0,0,0,0,0,0,0,0]
["HSS7X5X3/8","HSS","F",27.405793169415549,7.58,0,7,0,0,5,0,0,0,0,0.375,0.34899999999999998,0,0,0,0,0,0,0,0,0,11.3,0,17.100000000000001,0,49.5,17.5,14.1,2.56,29.3,13.8,11.7,1.97,0,60.6,0.375,21.4,0,0,0,0,0,0,0,0]
["HSS7X5X5/16","HSS","F",23.318458993215252,6.43,0,7,0,0,5,0,0,0,0,0.3125,0.29099999999999998,0,0,0,0,0,0,0,0,0,14.2,0,21.1,0,43,15,12.3,2.59,25.5,11.9,10.199999999999999,1.99,0,52.1,0.3125,18.3,0,0,0,0,0,0,0,0]
["HSS7X7X1/2","HSS","F",41.914983202347258,11.6,0,7,0,0,7,0,0,0,0,0.5,0.46500000000000002,0,0,0,0,0,0,0,0,0,12.1,0,12.1,0,80.5,27.9,23,2.63,0,0,0,0,0,133,0,39.299999999999997,0,0,0,0,0,0,0,0]
["HSS7X7X1/4","HSS","F",22.389126858673485,6.17,0,7,0,0,7,0,0,0,0,0.25,0.23300000000000001,0,0,0,0,0,0,0,0,0,27,0,27,0,46.5,15.5,13.3,2.75,0,0,0,0,0,73.5,0,21.3,0,0,0,0,0,0,0,0]
["HSS7X7X1/8","HSS","F",11.551817416650383,3.16,0,7,0,0,7,0,0,0,0,0.125,0.11600000000000001,0,0,0,0,0,0,0,0,0,57.3,0,57.3,0,24.8,8.1300000000000008,7.09,2.8,0,0,0,0,0,38.200000000000003,0,11,0,0,0,0,0,0,0,0]
["HSS7X7X3/16","HSS","F",17.059297520796697,4.67,0,7,0,0,7,0,0,0,0,0.1875,0.17399999999999999,0,0,0,0,0,0,0,0,0,37.200000000000003,0,37.200000000000003,0,36,11.9,10.3,2.77,0,0,0,0,0,56.1,0,16.2,0,0,0,0,0,0,0,0]
["HSS7X7X3/8","HSS","F",32.509959836082217,8.9700000000000006,0,7,0,0,7,0,0,0,0,0.375,0.34899999999999998,0,0,0,0,0,0,0,0,0,17.100000000000001,0,17.100000000000001,0,65,22.1,18.600000000000001,2.69,0,0,0,0,0,105,0,30.7,0,0,0,0,0,0,0,0]
["HSS7X7X5/16","HSS","F",27.53901954877081,7.59,0,7,0,0,7,0,0,0,0,0.3125,0.29099999999999998,0,0,0,0,0,0,0,0,0,21.1,0,21.1,0,56.1,18.899999999999999,16,2.72,0,0,0,0,0,89.7,0,26.1,0,0,0,0,0,0,0,0]
["HSS7X7X5/8","HSS","F",50.604196957468638,14,0,7,0,0,7,0,0,0,0,0.625,0.58099999999999996,0,0,0,0,0,0,0,0,0,9.0500000000000007,0,9.0500000000000007,0,93.4,33.1,26.7,2.58,0,0,0,0,0,158,0,47.1,0,0,0,0,0,0,0,0]
["HSS8.625X0.188","HSS","F",16.956232348286186,4.62,0,0,8.625,0,0,0,0,0,0,0.188,0.17399999999999999,0,0,0,0,0,0,0,0,0,0,0,0,49.6,41.3,12.4,9.57,2.99,41.3,12.4,9.57,2.99,0,82.5,0,19.100000000000001,0,0,0,0,0,0,0,0]
["HSS8.625X0.250","HSS","F",22.382484118349154,6.14,0,0,8.625,0,0,0,0,0,0,0.25,0.23300000000000001,0,0,0,0,0,0,0,0,0,0,0,0,37,54.1,16.399999999999999,12.5,2.97,54.1,16.399999999999999,12.5,2.97,0,108,0,25.1,0,0,0,0,0,0,0,0]
["HSS8.625X0.322","HSS","F",28.580799299992023,7.85,0,0,8.625,0,0,0,0,0,0,0.3125,0.3,0,0,0,0,0,0,0,0,0,0,0,0,28.8,68.099999999999994,20.8,15.8,2.95,68.099999999999994,20.8,15.8,2.95,0,136,0,31.6,0,0,0,0,0,0,0,0]
["HSS8.625X0.375","HSS","F",33.072625786814427,9.07,0,0,8.625,0,0,0,0,0,0,0.375,0.34899999999999998,0,0,0,0,0,0,0,0,0,0,0,0,24.7,77.8,23.9,18,2.93,77.8,23.9,18,2.93,0,156,0,36.1,0,0,0,0,0,0,0,0]
["HSS8.625X0.500","HSS","F",43.428700528140148,11.9,0,0,8.625,0,0,0,0,0,0,0.5,0.46500000000000002,0,0,0,0,0,0,0,0,0,0,0,0,18.5,100,31,23.1,2.89,100,31,23.1,2.89,0,199,0,46.2,0,0,0,0,0,0,0,0]
["HSS8.625X0.625","HSS","F",53.450708342326337,14.7,0,0,8.625,0,0,0,0,0,0,0.625,0.58099999999999996,0,0,0,0,0,0,0,0,0,0,0,0,14.8,119,37.700000000000003,27.7,2.85,119,37.700000000000003,27.7,2.85,0,239,0,55.4,0,0,0,0,0,0,0,0]
["HSS8X2X1/4","HSS","F",15.583571303117932,4.3,0,8,0,0,2,0,0,0,0,0.25,0.23300000000000001,0,0,0,0,0,0,0,0,0,5.58,0,31.3,0,28.5,9.68,7.12,2.57,2.94,3.43,2.94,0.82699999999999996,0,9.36,0.25,6.35,0,0,0,0,0,0,0,0]
["HSS8X2X1/8","HSS","F",8.1490396388726047,2.23,0,8,0,0,2,0,0,0,0,0.125,0.11600000000000001,0,0,0,0,0,0,0,0,0,14.2,0,66,0,15.7,5.19,3.93,2.65,1.72,1.9,1.72,0.879,0,5.3,0.125,3.44,0,0,0,0,0,0,0,0]
["HSS8X2X3/16","HSS","F",11.984421965241141,3.28,0,8,0,0,2,0,0,0,0,0.1875,0.17399999999999999,0,0,0,0,0,0,0,0,0,8.49,0,43,0,22.4,7.51,5.61,2.61,2.39,2.7,2.39,0.85299999999999998,0,7.48,0.1875,4.95,0,0,0,0,0,0,0,0]
["HSS8X2X3/8","HSS","F",22.301626502748881,6.18,0,8,0,0,2,0,0,0,0,0.375,0.34899999999999998,0,0,0,0,0,0,0,0,0,2.73,0,19.899999999999999,0,38.200000000000003,13.4,9.56,2.4900000000000002,3.73,4.6100000000000003,3.73,0.77700000000000002,0,12.1,0.375,8.65,0,0,0,0,0,0,0,0]
["HSS8X2X5/16","HSS","F",19.058181215437475,5.26,0,8,0,0,2,0,0,0,0,0.3125,0.29099999999999998,0,0,0,0,0,0,0,0,0,3.87,0,24.5,0,33.700000000000003,11.6,8.43,2.5299999999999998,3.38,4.0599999999999996,3.38,0.80200000000000005,0,10.9,0.3125,7.57,0,0,0,0,0,0,0,0]
["HSS8X3X1/2","HSS","F",31.706649869013926,8.81,0,8,0,0,3,0,0,0,0,0.5,0.46500000000000002,0,0,0,0,0,0,0,0,0,3.45,0,14.2,0,58.6,20,14.6,2.58,11.7,9.64,7.81,1.1499999999999999,0,34.299999999999997,0.5,17.399999999999999,0,0,0,0,0,0,0,0]
["HSS8X3X1/4","HSS","F",17.284960192006821,4.7699999999999996,0,8,0,0,3,0,0,0,0,0.25,0.23300000000000001,0,0,0,0,0,0,0,0,0,9.8800000000000008,0,31.3,0,35.5,11.5,8.8800000000000008,2.73,7.49,5.7,4.99,1.25,0,20.8,0.25,10,0,0,0,0,0,0,0,0]
["HSS8X3X1/8","HSS","F",8.9997340833170494,2.46,0,8,0,0,3,0,0,0,0,0.125,0.11600000000000001,0,0,0,0,0,0,0,0,0,22.9,0,66,0,19.3,6.11,4.83,2.8,4.2,3.07,2.8,1.31,0,11.3,0.125,5.27,0,0,0,0,0,0,0,0]
["HSS8X3X3/16","HSS","F",13.263866409685585,3.63,0,8,0,0,3,0,0,0,0,0.1875,0.17399999999999999,0,0,0,0,0,0,0,0,0,14.2,0,43,0,27.8,8.8699999999999992,6.94,2.77,5.94,4.43,3.96,1.28,0,16.2,0.1875,7.68,0,0,0,0,0,0,0,0]
["HSS8X3X3/8","HSS","F",24.853709836082217,6.88,0,8,0,0,3,0,0,0,0,0.375,0.34899999999999998,0,0,0,0,0,0,0,0,0,5.6,0,19.899999999999999,0,48.5,16.100000000000001,12.1,2.65,10,7.88,6.63,1.2,0,28.5,0.375,14,0,0,0,0,0,0,0,0]
["HSS8X3X5/16","HSS","F",21.188320104326365,5.85,0,8,0,0,3,0,0,0,0,0.3125,0.29099999999999998,0,0,0,0,0,0,0,0,0,7.31,0,24.5,0,42.4,13.9,10.6,2.69,8.81,6.84,5.87,1.23,0,24.9,0.3125,12.1,0,0,0,0,0,0,0,0]
["HSS8X4X1/2","HSS","F",35.109427646791701,9.74,0,8,0,0,4,0,0,0,0,0.5,0.46500000000000002,0,0,0,0,0,0,0,0,0,5.6,0,14.2,0,71.8,23.5,17.899999999999999,2.71,23.6,14.3,11.8,1.56,0,61.1,0.5,24.4,0,0,0,0,0,0,0,0]
["HSS8X4X1/4","HSS","F",18.98634908089571,5.24,0,8,0,0,4,0,0,0,0,0.25,0.23300000000000001,0,0,0,0,0,0,0,0,0,14.2,0,31.3,0,42.5,13.3,10.6,2.85,14.4,8.1999999999999993,7.21,1.66,0,35.299999999999997,0.25,13.6,0,0,0,0,0,0,0,0]
["HSS8X4X1/8","HSS","F",9.850428527761494,2.7,0,8,0,0,4,0,0,0,0,0.125,0.11600000000000001,0,0,0,0,0,0,0,0,0,31.5,0,66,0,22.9,7.02,5.73,2.92,7.9,4.3600000000000003,3.95,1.71,0,18.7,0.125,7.1,0,0,0,0,0,0,0,0]
["HSS8X4X3/16","HSS","F",14.543310854130031,3.98,0,8,0,0,4,0,0,0,0,0.1875,0.17399999999999999,0,0,0,0,0,0,0,0,0,20,0,43,0,33.1,10.199999999999999,8.27,2.88,11.3,6.33,5.65,1.69,0,27.2,0.1875,10.4,0,0,0,0,0,0,0,0]
["HSS8X4X3/8","HSS","F",27.405793169415549,7.58,0,8,0,0,4,0,0,0,0,0.375,0.34899999999999998,0,0,0,0,0,0,0,0,0,8.4600000000000009,0,19.899999999999999,0,58.7,18.8,14.7,2.78,19.600000000000001,11.5,9.8000000000000007,1.61,0,49.3,0.375,19.3,0,0,0,0,0,0,0,0]
["HSS8X4X5/16","HSS","F",23.318458993215252,6.43,0,8,0,0,4,0,0,0,0,0.3125,0.29099999999999998,0,0,0,0,0,0,0,0,0,10.7,0,24.5,0,51,16.100000000000001,12.8,2.82,17.2,9.91,8.58,1.63,0,42.6,0.3125,16.5,0,0,0,0,0,0,0,0]
["HSS8X4X5/8","HSS","F",42.097252513024195,11.7,0,8,0,0,4,0,0,0,0,0.625,0.58099999999999996,0,0,0,0,0,0,0,0,0,3.88,0,10.8,0,82,27.4,20.5,2.64,26.6,16.600000000000001,13.3,1.51,0,70.3,0.625,28.7,0,0,0,0,0,0,0,0]
["HSS8X6X1/2","HSS","F",41.914983202347258,11.6,0,8,0,0,6,0,0,0,0,0.5,0.46500000000000002,0,0,0,0,0,0,0,0,0,9.9,0,14.2,0,98.2,30.5,24.6,2.91,62.5,24.9,20.8,2.3199999999999998,0,127,0.5,38.4,0,0,0,0,0,0,0,0]
["HSS8X6X1/4","HSS","F",22.389126858673485,6.17,0,8,0,0,6,0,0,0,0,0.25,0.23300000000000001,0,0,0,0,0,0,0,0,0,22.8,0,31.3,0,56.6,16.899999999999999,14.2,3.03,36.4,13.9,12.1,2.4300000000000002,0,70.3,0.25,20.8,0,0,0,0,0,0,0,0]
["HSS8X6X3/16","HSS","F",17.102199743018918,4.67,0,8,0,0,6,0,0,0,0,0.1875,0.17399999999999999,0,0,0,0,0,0,0,0,0,31.5,0,43,0,43.7,13,10.9,3.06,28.2,10.7,9.39,2.46,0,53.7,0.1875,15.8,0,0,0,0,0,0,0,0]
["HSS8X6X3/8","HSS","F",32.509959836082217,8.9700000000000006,0,8,0,0,6,0,0,0,0,0.375,0.34899999999999998,0,0,0,0,0,0,0,0,0,14.2,0,19.899999999999999,0,79.099999999999994,24.1,19.8,2.97,50.6,19.8,16.899999999999999,2.38,0,100,0.375,30,0,0,0,0,0,0,0,0]
["HSS8X6X5/16","HSS","F",27.578736770993032,7.59,0,8,0,0,6,0,0,0,0,0.3125,0.29099999999999998,0,0,0,0,0,0,0,0,0,17.600000000000001,0,24.5,0,68.3,20.6,17.100000000000001,3,43.8,16.899999999999999,14.6,2.4,0,85.8,0.3125,25.5,0,0,0,0,0,0,0,0]
["HSS8X6X5/8","HSS","F",50.604196957468638,14,0,8,0,0,6,0,0,0,0,0.625,0.58099999999999996,0,0,0,0,0,0,0,0,0,7.33,0,10.8,0,114,36.1,28.5,2.85,72.3,29.5,24.1,2.27,0,150,0.625,46,0,0,0,0,0,0,0,0]
["HSS8X8X1/2","HSS","F",48.720538757902816,13.5,0,8,0,0,8,0,0,0,0,0.5,0.46500000000000002,0,0,0,0,0,0,0,0,0,14.2,0,14.2,0,125,37.5,31.2,3.04,0,0,0,0,0,204,0,52.4,0,0,0,0,0,0,0,0]
["HSS8X8X1/4","HSS","F",25.791904636451264,7.1,0,8,0,0,8,0,0,0,0,0.25,0.23300000000000001,0,0,0,0,0,0,0,0,0,31.3,0,31.3,0,70.7,20.5,17.7,3.15,0,0,0,0,0,111,0,28.1,0,0,0,0,0,0,0,0]
["HSS8X8X1/8","HSS","F",13.253206305539271,3.62,0,8,0,0,8,0,0,0,0,0.125,0.11600000000000001,0,0,0,0,0,0,0,0,0,66,0,66,0,37.4,10.7,9.34,3.21,0,0,0,0,0,57.3,0,14.4,0,0,0,0,0,0,0,0]
["HSS8X8X3/16","HSS","F",19.611380854130029,5.37,0,8,0,0,8,0,0,0,0,0.1875,0.17399999999999999,0,0,0,0,0,0,0,0,0,43,0,43,0,54.4,15.7,13.6,3.18,0,0,0,0,0,84.5,0,21.3,0,0,0,0,0,0,0,0]
["HSS8X8X3/8","HSS","F",37.614126502748881,10.4,0,8,0,0,8,0,0,0,0,0.375,0.34899999999999998,0,0,0,0,0,0,0,0,0,19.899999999999999,0,19.899999999999999,0,100,29.4,24.9,3.1,0,0,0,0,0,160,0,40.700000000000003,0,0,0,0,0,0,0,0]
["HSS8X8X5/16","HSS","F",31.792491770993031,8.76,0,8,0,0,8,0,0,0,0,0.3125,0.29099999999999998,0,0,0,0,0,0,0,0,0,24.5,0,24.5,0,85.6,25.1,21.4,3.13,0,0,0,0,0,136,0,34.5,0,0,0,0,0,0,0,0]
["HSS8X8X5/8","HSS","F",59.111141401913081,16.399999999999999,0,8,0,0,8,0,0,0,0,0.625,0.58099999999999996,0,0,0,0,0,0,0,0,0,10.8,0,10.8,0,146,44.7,36.5,2.99,0,0,0,0,0,244,0,63.2,0,0,0,0,0,0,0,0]
["HSS9.625X0.188","HSS","F",18.965978981957644,5.17,0,0,9.625,0,0,0,0,0,0,0.1875,0.17399999999999999,0,0,0,0,0,0,0,0,0,0,0,0,55.3,57.7,15.5,12,3.34,57.7,15.5,12,3.34,0,115,0,24,0,0,0,0,0,0,0,0]
["HSS9.625X0.250","HSS","F",25.055019535465473,6.87,0,0,9.625,0,0,0,0,0,0,0.25,0.23300000000000001,0,0,0,0,0,0,0,0,0,0,0,0,41.3,75.900000000000006,20.6,15.8,3.32,75.900000000000006,20.6,15.8,3.32,0,152,0,31.5,0,0,0,0,0,0,0,0]
["HSS9.625X0.312","HSS","F",31.061874279826156,8.5299999999999994,0,0,9.625,0,0,0,0,0,0,0.3125,0.29099999999999998,0,0,0,0,0,0,0,0,0,0,0,0,33.1,93,25.4,19.3,3.3,93,25.4,19.3,3.3,0,186,0,38.700000000000003,0,0,0,0,0,0,0,0]
["HSS9.625X0.375","HSS","F",37.081428912488896,10.199999999999999,0,0,9.625,0,0,0,0,0,0,0.375,0.34899999999999998,0,0,0,0,0,0,0,0,0,0,0,0,27.6,110,30,22.8,3.28,110,30,22.8,3.28,0,219,0,45.5,0,0,0,0,0,0,0,0]
["HSS9.625X0.500","HSS","F",48.773771362372784,13.4,0,0,9.625,0,0,0,0,0,0,0.5,0.46500000000000002,0,0,0,0,0,0,0,0,0,0,0,0,20.7,141,39,29.2,3.24,141,39,29.2,3.24,0,281,0,58.5,0,0,0,0,0,0,0,0]
["HSS9X3X1/2","HSS","F",35.109427646791701,9.74,0,9,0,0,3,0,0,0,0,0.5,0.46500000000000002,0,0,0,0,0,0,0,0,0,3.45,0,16.399999999999999,0,80.8,24.6,18,2.88,13.2,10.8,8.81,1.17,0,40,0.5,19.7,0,0,0,0,0,0,0,0]
["HSS9X3X1/4","HSS","F",18.98634908089571,5.24,0,9,0,0,3,0,0,0,0,0.25,0.23300000000000001,0,0,0,0,0,0,0,0,0,9.8800000000000008,0,35.6,0,48.2,14,10.7,3.04,8.3800000000000008,6.35,5.59,1.27,0,24.2,0.25,11.3,0,0,0,0,0,0,0,0]
["HSS9X3X3/16","HSS","F",14.543310854130031,3.98,0,9,0,0,3,0,0,0,0,0.1875,0.17399999999999999,0,0,0,0,0,0,0,0,0,14.2,0,48.7,0,37.6,10.8,8.35,3.07,6.64,4.92,4.42,1.29,0,18.899999999999999,0.1875,8.66,0,0,0,0,0,0,0,0]
["HSS9X3X3/8","HSS","F",27.405793169415549,7.58,0,9,0,0,3,0,0,0,0,0.375,0.34899999999999998,0,0,0,0,0,0,0,0,0,5.6,0,22.8,0,66.3,19.7,14.7,2.96,11.2,8.8000000000000007,7.45,1.21,0,33.1,0.375,15.8,0,0,0,0,0,0,0,0]
["HSS9X3X5/16","HSS","F",23.318458993215252,6.43,0,9,0,0,3,0,0,0,0,0.3125,0.29099999999999998,0,0,0,0,0,0,0,0,0,7.31,0,27.9,0,57.7,16.899999999999999,12.8,3,9.8800000000000008,7.63,6.59,1.24,0,28.9,0.3125,13.6,0,0,0,0,0,0,0,0]
["HSS9X5X1/2","HSS","F",41.914983202347258,11.6,0,9,0,0,5,0,0,0,0,0.5,0.46500000000000002,0,0,0,0,0,0,0,0,0,7.75,0,16.399999999999999,0,115,32.5,25.5,3.14,45.2,21.5,18.100000000000001,1.97,0,109,0.5,35.6,0,0,0,0,0,0,0,0]
["HSS9X5X1/4","HSS","F",22.389126858673485,6.17,0,9,0,0,5,0,0,0,0,0.25,0.23300000000000001,0,0,0,0,0,0,0,0,0,18.5,0,35.6,0,66.099999999999994,18.100000000000001,14.7,3.27,26.6,12,10.6,2.08,0,61.2,0.25,19.399999999999999,0,0,0,0,0,0,0,0]
["HSS9X5X3/16","HSS","F",17.102199743018918,4.67,0,9,0,0,5,0,0,0,0,0.1875,0.17399999999999999,0,0,0,0,0,0,0,0,0,25.7,0,48.7,0,51.1,13.8,11.4,3.31,20.7,9.25,8.2799999999999994,2.1,0,46.9,0.1875,14.8,0,0,0,0,0,0,0,0]
["HSS9X5X3/8","HSS","F",32.509959836082217,8.9700000000000006,0,9,0,0,5,0,0,0,0,0.375,0.34899999999999998,0,0,0,0,0,0,0,0,0,11.3,0,22.8,0,92.5,25.7,20.5,3.21,36.799999999999997,17.100000000000001,14.7,2.0299999999999998,0,86.9,0.375,27.9,0,0,0,0,0,0,0,0]
["HSS9X5X5/16","HSS","F",27.578736770993032,7.59,0,9,0,0,5,0,0,0,0,0.3125,0.29099999999999998,0,0,0,0,0,0,0,0,0,14.2,0,27.9,0,79.8,22,17.7,3.24,32,14.6,12.8,2.0499999999999998,0,74.400000000000006,0.3125,23.8,0,0,0,0,0,0,0,0]
["HSS9X5X5/8","HSS","F",50.604196957468638,14,0,9,0,0,5,0,0,0,0,0.625,0.58099999999999996,0,0,0,0,0,0,0,0,0,5.61,0,12.5,0,133,38.5,29.6,3.08,52,25.3,20.8,1.92,0,128,0.625,42.5,0,0,0,0,0,0,0,0]
["HSS9X7X1/2","HSS","F",48.720538757902816,13.5,0,9,0,0,7,0,0,0,0,0.5,0.46500000000000002,0,0,0,0,0,0,0,0,0,12.1,0,16.399999999999999,0,149,40.5,33,3.32,100,34,28.7,2.73,0,197,0.5,51.5,0,0,0,0,0,0,0,0]
["HSS9X7X1/4","HSS","F",25.791904636451264,7.1,0,9,0,0,7,0,0,0,0,0.25,0.23300000000000001,0,0,0,0,0,0,0,0,0,27,0,35.6,0,84.1,22.2,18.7,3.44,57.2,18.7,16.3,2.84,0,107,0.25,27.6,0,0,0,0,0,0,0,0]
["HSS9X7X3/16","HSS","F",19.661088631907809,5.37,0,9,0,0,7,0,0,0,0,0.1875,0.17399999999999999,0,0,0,0,0,0,0,0,0,37.200000000000003,0,48.7,0,64.7,16.899999999999999,14.4,3.47,44.1,14.3,12.6,2.87,0,81.7,0.1875,20.9,0,0,0,0,0,0,0,0]
["HSS9X7X3/8","HSS","F",37.614126502748881,10.4,0,9,0,0,7,0,0,0,0,0.375,0.34899999999999998,0,0,0,0,0,0,0,0,0,17.100000000000001,0,22.8,0,119,31.8,26.4,3.38,80.400000000000006,26.7,23,2.78,0,154,0.375,40,0,0,0,0,0,0,0,0]
["HSS9X7X5/16","HSS","F",31.839014548770809,8.76,0,9,0,0,7,0,0,0,0,0.3125,0.29099999999999998,0,0,0,0,0,0,0,0,0,21.1,0,27.9,0,102,27.1,22.6,3.41,69.2,22.8,19.8,2.81,0,131,0.3125,33.9,0,0,0,0,0,0,0,0]
["HSS9X7X5/8","HSS","F",59.111141401913081,16.399999999999999,0,9,0,0,7,0,0,0,0,0.625,0.58099999999999996,0,0,0,0,0,0,0,0,0,9.0500000000000007,0,12.5,0,174,48.3,38.700000000000003,3.26,117,40.5,33.5,2.68,0,235,0.625,62,0,0,0,0,0,0,0,0]
["HSS9X9X1/2","HSS","F",55.52609431345838,15.3,0,9,0,0,9,0,0,0,0,0.5,0.46500000000000002,0,0,0,0,0,0,0,0,0,16.399999999999999,0,16.399999999999999,0,183,48.4,40.6,3.45,0,0,0,0,0,296,0,67.400000000000006,0,0,0,0,0,0,0,0]
["HSS9X9X1/4","HSS","F",29.194682414229042,8.0299999999999994,0,9,0,0,9,0,0,0,0,0.25,0.23300000000000001,0,0,0,0,0,0,0,0,0,35.6,0,35.6,0,102,26.2,22.7,3.56,0,0,0,0,0,159,0,35.799999999999997,0,0,0,0,0,0,0,0]
["HSS9X9X1/8","HSS","F",14.95459519442816,4.09,0,9,0,0,9,0,0,0,0,0.125,0.11600000000000001,0,0,0,0,0,0,0,0,0,74.599999999999994,0,74.599999999999994,0,53.5,13.6,11.9,3.62,0,0,0,0,0,82,0,18.3,0,0,0,0,0,0,0,0]
["HSS9X9X3/16","HSS","F",22.163464187463362,6.06,0,9,0,0,9,0,0,0,0,0.1875,0.17399999999999999,0,0,0,0,0,0,0,0,0,48.7,0,48.7,0,78.2,20,17.399999999999999,3.59,0,0,0,0,0,121,0,27.1,0,0,0,0,0,0,0,0]
["HSS9X9X3/8","HSS","F",42.718293169415546,11.8,0,9,0,0,9,0,0,0,0,0.375,0.34899999999999998,0,0,0,0,0,0,0,0,0,22.8,0,22.8,0,145,37.799999999999997,32.200000000000003,3.51,0,0,0,0,0,231,0,52.1,0,0,0,0,0,0,0,0]
["HSS9X9X5/16","HSS","F",36.045963993215253,9.92,0,9,0,0,9,0,0,0,0,0.3125,0.29099999999999998,0,0,0,0,0,0,0,0,0,27.9,0,27.9,0,124,32.1,27.6,3.54,0,0,0,0,0,196,0,44,0,0,0,0,0,0,0,0]
["HSS9X9X5/8","HSS","F",67.61808584635753,18.7,0,9,0,0,9,0,0,0,0,0.625,0.58099999999999996,0,0,0,0,0,0,0,0,0,12.5,0,12.5,0,216,58.1,47.9,3.4,0,0,0,0,0,356,0,81.599999999999994,0,0,0,0,0,0,0,0]
["M10X7.5","M","F",7.5,2.2200000000000002,10,0,0,2.69,0,0,0.13,0.17299999999999999,0,0,0,0.438,0.4375,0.3125,0,0,0,0,0,7.77,0,71,0,0,33,7.77,6.6,3.85,0.56200000000000006,0.67,0.41799999999999998,0.503,0,1.8700000000000001E-2,13.5,0,6.6,0.77,1.0900000000000001,3.8,0,0,0,0]
["M10X8","M","F",8,2.37,10,0,0,2.69,0,0,0.14099999999999999,0.182,0,0,0,0.56299999999999994,0.5625,0.375,0,0,0,0,0,7.39,0,65,0,0,34.6,8.1999999999999993,6.95,3.82,0.59299999999999997,0.71099999999999997,0.441,0.5,0,2.24E-2,14.2,0,6.57,0.8,1.1299999999999999,4.01,0,0,0,0]
["M10X9","M","F",9,2.65,10,0,0,2.69,0,0,0.157,0.20599999999999999,0,0,0,0.56299999999999994,0.5625,0.375,0,0,0,0,0,6.53,0,58.4,0,0,39,9.2200000000000006,7.79,3.83,0.67200000000000004,0.80900000000000005,0.5,0.503,0,3.1399999999999997E-2,16.100000000000001,0,6.59,0.91,1.28,4.5199999999999996,0,0,0,0]
["M12.5X11.6","M","F",11.6,3.4,12.5,0,0,3.5,0,0,0.155,0.21099999999999999,0,0,0,0.56299999999999994,0.5625,0.375,0,0,0,0,0,8.2899999999999991,0,74.8,0,0,80.3,15,12.8,4.8600000000000003,1.51,1.37,0.86399999999999999,0.66700000000000004,0,4.1399999999999999E-2,57.1,0,10.8,1.99,2.17,7.36,0,0,0,0]
["M12.5X12.4","M","F",12.4,3.63,12.5,0,0,3.75,0,0,0.155,0.22800000000000001,0,0,0,0.56299999999999994,0.5625,0.375,0,0,0,0,0,8.2200000000000006,0,74.8,0,0,89.3,16.5,14.2,4.96,2.0099999999999998,1.68,1.07,0.74399999999999999,0,4.9299999999999997E-2,76,0,11.5,2.46,2.5099999999999998,8.06,0,0,0,0]
["M12X10","M","F",10,2.95,12,0,0,3.25,0,0,0.14899999999999999,0.18,0,0,0,0.5,0.5,0.375,0,0,0,0,0,9.0299999999999994,0,74.7,0,0,61.7,12.2,10.3,4.57,1.03,1.02,0.63600000000000001,0.59199999999999997,0,2.92E-2,35.9,0,9.6,1.4,1.65,5.98,0,0,0,0]
["M12X10.8","M","F",10.8,3.18,12,0,0,3.07,0,0,0.16,0.21,0,0,0,0.56299999999999994,0.5625,0.375,0,0,0,0,0,7.3,0,69.2,0,0,66.7,13.2,11.1,4.58,1.01,1.07,0.66100000000000003,0.56399999999999995,0,3.9300000000000002E-2,35,0,9.0500000000000007,1.46,1.8,6.48,0,0,0,0]
["M12X11.8","M","F",11.8,3.47,12,0,0,3.07,0,0,0.17699999999999999,0.22500000000000001,0,0,0,0.56299999999999994,0.5625,0.375,0,0,0,0,0,6.81,0,62.5,0,0,72.2,14.3,12,4.5599999999999996,1.0900000000000001,1.1499999999999999,0.70899999999999996,0.55900000000000005,0,0.05,37.700000000000003,0,9.0399999999999991,1.56,1.92,7.02,0,0,0,0]
["M3X2.9","M","F",2.9,0.91400000000000003,3,0,0,2.25,0,0,0.09,0.13,0,0,0,0.5,0.5,0.375,0,0,0,0,0,8.65,0,23.6,0,0,1.5,1.1200000000000001,1,1.28,0.248,0.34399999999999997,0.221,0.52100000000000002,0,7.9000000000000008E-3,0.51100000000000001,0,1.61,0.12,0.2,0.5,0,0,0,0]
["M4X3.2","M","F",3.2,1.01,4,0,0,2.25,0,0,9.1999999999999998E-2,0.13,0,0,0,0.5,0.5,0.375,0,0,0,0,0,8.65,0,33.9,0,0,2.86,1.6,1.43,1.68,0.248,0.34599999999999997,0.221,0.496,0,8.2000000000000007E-3,0.93,0,2.1800000000000002,0.16,0.27,0.73,0,0,0,0]
["M4X3.45","M","F",3.45,1.01,4,0,0,2.25,0,0,9.1999999999999998E-2,0.13,0,0,0,0.5,0.5,0.375,0,0,0,0,0,8.65,0,33.9,0,0,2.86,1.6,1.43,1.68,0.248,0.34599999999999997,0.221,0.496,0,8.2000000000000007E-3,0.93,0,2.1800000000000002,0.16,0.27,0.73,0,0,0,0]
["M4X4.08","M","F",4.09,1.27,4,0,0,2.25,0,0,0.115,0.17,0,0,0,0.56299999999999994,0.5625,0.375,0,0,0,0,0,6.62,0,26.4,0,0,3.53,2,1.77,1.67,0.32500000000000001,0.45300000000000001,0.28899999999999998,0.50600000000000001,0,1.47E-2,1.19,0,2.15,0.21,0.35,0.93,0,0,0,0]
["M4X6","M","F",6,1.75,3.8,0,0,3.8,0,0,0.13,0.16,0,0,0,0.5,0.5,0.375,0,0,0,0,0,11.9,0,22,0,0,4.72,2.74,2.48,1.64,1.47,1.18,0.77100000000000002,0.91500000000000004,0,1.84E-2,4.87,0,3.46,0.53,0.53,1.3,0,0,0,0]
["M5X18.9","M","T",18.899999999999999,5.56,5,0,0,5,0,0,0.316,0.41599999999999998,0,0,0,0.81299999999999994,0.8125,0.5,0,0,0,0,0,6.01,0,11.2,0,0,24.2,11.1,9.67,2.08,8.6999999999999993,5.33,3.48,1.25,0,0.313,45.7,0,5.73,2.98,2.23,5.45,0,0,0,0]
["M6X3.7","M","F",3.7,1.0900000000000001,5.92,0,0,2,0,0,9.8000000000000004E-2,0.129,0,0,0,0.313,0.3125,0.25,0,0,0,0,0,7.75,0,54.7,0,0,5.96,2.33,2.0099999999999998,2.34,0.17299999999999999,0.27300000000000002,0.17299999999999999,0.39800000000000002,0,5.3E-3,1.45,0,2.9,0.19,0.36,1.1399999999999999,0,0,0,0]
["M6X4.4","M","F",4.4000000000000004,1.29,6,0,0,1.84,0,0,0.114,0.17100000000000001,0,0,0,0.375,0.375,0.25,0,0,0,0,0,5.39,0,47,0,0,7.23,2.8,2.41,2.36,0.18,0.311,0.19500000000000001,0.372,0,9.9000000000000008E-3,1.53,0,2.68,0.21,0.43,1.37,0,0,0,0]
["M8X6.2","M","F",6.2,1.82,8,0,0,2.2799999999999998,0,0,0.129,0.17699999999999999,0,0,0,0.438,0.4375,0.25,0,0,0,0,0,6.44,0,56.5,0,0,17.600000000000001,5.15,4.3899999999999997,3.1,0.35199999999999998,0.495,0.308,0.439,0,1.5599999999999999E-2,5.38,0,4.46,0.45,0.74,2.52,0,0,0,0]
["M8X6.5","M","F",6.5,1.92,8,0,0,2.2799999999999998,0,0,0.13500000000000001,0.189,0,0,0,0.56299999999999994,0.5625,0.375,0,0,0,0,0,6.03,0,53.8,0,0,18.5,5.43,4.63,3.11,0.376,0.52900000000000003,0.32900000000000001,0.443,0,1.84E-2,5.73,0,4.45,0.48,0.79,2.66,0,0,0,0]
["MC10X22","MC","F",22,6.45,10,0,0,3.32,0,0,0.28999999999999998,0.57499999999999996,0,0,0,1.31,1.3125,0,0.99,0,1.1200000000000001,0.46700000000000003,0,0,0,0,0,0,102,23.9,20.5,3.99,6.4,5.29,2.75,0.997,0,0.51,110,0,0,0,0,0,4.62,0.79100000000000004,0,0]
["MC10X25","MC","F",25,7.35,10,0,0,3.41,0,0,0.38,0.57499999999999996,0,0,0,1.31,1.3125,0,0.95299999999999996,0,1.03,0.36699999999999999,0,0,0,0,0,0,110,26.2,22,3.87,7.25,5.65,2.96,0.99299999999999999,0,0.63800000000000001,124,0,0,0,0,0,4.46,0.80300000000000005,0,0]
["MC10X28.5","MC","F",28.5,8.3699999999999992,10,0,0,3.95,0,0,0.42499999999999999,0.57499999999999996,0,0,0,1.31,1.3125,0,1.1200000000000001,0,1.21,0.41899999999999998,0,0,0,0,0,0,126,30,25.3,3.89,11.3,7.59,3.99,1.1599999999999999,0,0.79100000000000004,193,0,0,0,0,0,4.68,0.752,0,0]
["MC10X33.6","MC","F",33.6,9.8699999999999992,10,0,0,4.0999999999999996,0,0,0.57499999999999996,0.57499999999999996,0,0,0,1.31,1.3125,0,1.0900000000000001,0,1.06,0.49399999999999999,0,0,0,0,0,0,139,33.700000000000003,27.8,3.75,13.1,8.2799999999999994,4.3499999999999996,1.1499999999999999,0,1.2,224,0,0,0,0,0,4.47,0.77,0,0]
["MC10X41.1","MC","F",41.1,12.1,10,0,0,4.32,0,0,0.79600000000000004,0.57499999999999996,0,0,0,1.31,1.3125,0,1.0900000000000001,0,0.86399999999999999,0.60399999999999998,0,0,0,0,0,0,157,39.299999999999997,31.5,3.61,15.7,9.49,4.8499999999999996,1.1399999999999999,0,2.2599999999999998,269,0,0,0,0,0,4.26,0.79,0,0]
["MC10X6.5","MC","F",6.5,1.95,10,0,0,1.17,0,0,0.152,0.20200000000000001,0,0,0,0.56299999999999994,0.5625,0,0.19400000000000001,0,0.182,9.7500000000000003E-2,0,0,0,0,0,0,22.9,5.9,4.59,3.43,0.13300000000000001,0.28399999999999997,0.13700000000000001,0.26200000000000001,0,1.9099999999999999E-2,2.76,0,0,0,0,0,3.46,0.98799999999999999,0,0]
["MC10X8.4","MC","F",8.4,2.46,10,0,0,1.5,0,0,0.17,0.28000000000000003,0,0,0,0.75,0.75,0,0.28399999999999997,0,0.33200000000000002,0.123,0,0,0,0,0,0,31.9,7.92,6.39,3.61,0.32600000000000001,0.54800000000000004,0.26800000000000002,0.36399999999999999,0,4.1300000000000003E-2,7,0,0,0,0,0,3.68,0.97199999999999998,0,0]
["MC12X10.6","MC","F",10.6,3.1,12,0,0,1.5,0,0,0.19,0.309,0,0,0,0.75,0.75,0,0.26900000000000002,0,0.28399999999999997,0.129,0,0,0,0,0,0,55.3,11.6,9.2200000000000006,4.22,0.378,0.63500000000000001,0.307,0.34899999999999998,0,5.96E-2,11.7,0,0,0,0,0,4.2699999999999996,0.98299999999999998,0,0]
["MC12X31","MC","F",31,9.1199999999999992,12,0,0,3.67,0,0,0.37,0.7,0,0,0,1.31,1.3125,0,1.08,0,1.17,0.42499999999999999,0,0,0,0,0,0,202,39.700000000000003,33.700000000000003,4.71,11.3,8.15,4.37,1.1100000000000001,0,1,267,0,0,0,0,0,5.34,0.82199999999999995,0,0]
["MC12X35","MC","F",35,10.3,12,0,0,3.77,0,0,0.46500000000000002,0.7,0,0,0,1.31,1.3125,0,1.05,0,1.07,0.42799999999999999,0,0,0,0,0,0,216,43.2,36,4.59,12.6,8.6199999999999992,4.6399999999999997,1.1100000000000001,0,1.24,297,0,0,0,0,0,5.18,0.83099999999999996,0,0]
["MC12X40","MC","F",40,11.8,12,0,0,3.89,0,0,0.59,0.7,0,0,0,1.31,1.3125,0,1.04,0,0.95199999999999996,0.49,0,0,0,0,0,0,234,47.7,39,4.46,14.2,9.31,4.9800000000000004,1.1000000000000001,0,1.69,336,0,0,0,0,0,5.01,0.84199999999999997,0,0]
["MC12X45","MC","F",45,13.2,12,0,0,4.01,0,0,0.71,0.7,0,0,0,1.31,1.3125,0,1.04,0,0.84399999999999997,0.55000000000000004,0,0,0,0,0,0,251,52,41.9,4.3600000000000003,15.8,10.1,5.3,1.0900000000000001,0,2.33,373,0,0,0,0,0,4.88,0.85099999999999998,0,0]
["MC12X50","MC","F",50,14.7,12,0,0,4.1399999999999997,0,0,0.83499999999999996,0.7,0,0,0,1.31,1.3125,0,1.05,0,0.74099999999999999,0.61299999999999999,0,0,0,0,0,0,269,56.5,44.9,4.28,17.399999999999999,10.9,5.64,1.0900000000000001,0,3.23,411,0,0,0,0,0,4.7699999999999996,0.85899999999999999,0,0]
["MC13X31.8","MC","F",31.8,9.35,13,0,0,4,0,0,0.375,0.61,0,0,0,1.44,1.4375,0,1,0,1.24,0.36,0,0,0,0,0,0,239,43.4,36.700000000000003,5.05,11.4,7.69,3.79,1.1000000000000001,0,0.93700000000000006,380,0,0,0,0,0,5.64,0.84199999999999997,0,0]
["MC13X35","MC","F",35,10.3,13,0,0,4.07,0,0,0.44700000000000001,0.61,0,0,0,1.44,1.4375,0,0.98,0,1.1599999999999999,0.39600000000000002,0,0,0,0,0,0,252,46.5,38.799999999999997,4.95,12.3,8.0399999999999991,3.97,1.0900000000000001,0,1.1299999999999999,412,0,0,0,0,0,5.5,0.84899999999999998,0,0]
["MC13X40","MC","F",40,11.8,13,0,0,4.1900000000000004,0,0,0.56000000000000005,0.61,0,0,0,1.44,1.4375,0,0.96299999999999997,0,1.03,0.45200000000000001,0,0,0,0,0,0,273,51.2,41.9,4.82,13.7,8.66,4.24,1.08,0,1.55,462,0,0,0,0,0,5.32,0.85899999999999999,0,0]
["MC13X50","MC","F",50,14.7,13,0,0,4.41,0,0,0.78700000000000003,0.61,0,0,0,1.44,1.4375,0,0.97399999999999998,0,0.81499999999999995,0.56599999999999995,0,0,0,0,0,0,314,60.8,48.3,4.62,16.399999999999999,10.199999999999999,4.7699999999999996,1.06,0,2.96,558,0,0,0,0,0,5.07,0.875,0,0]
["MC18X42.7","MC","F",42.7,12.6,18,0,0,3.95,0,0,0.45,0.625,0,0,0,1.44,1.4375,0,0.877,0,0.96899999999999997,0.34899999999999998,0,0,0,0,0,0,554,75.099999999999994,61.5,6.64,14.3,8.82,4.6399999999999997,1.07,0,1.23,852,0,0,0,0,0,6.97,0.93,0,0]
["MC18X45.8","MC","F",45.8,13.5,18,0,0,4,0,0,0.5,0.625,0,0,0,1.44,1.4375,0,0.86599999999999999,0,0.90900000000000003,0.374,0,0,0,0,0,0,578,79.2,64.2,6.55,14.9,9.14,4.7699999999999996,1.05,0,1.45,897,0,0,0,0,0,6.87,0.93300000000000005,0,0]
["MC18X51.9","MC","F",51.9,15.3,18,0,0,4.0999999999999996,0,0,0.6,0.625,0,0,0,1.44,1.4375,0,0.85799999999999998,0,0.79700000000000004,0.42399999999999999,0,0,0,0,0,0,627,87.3,69.599999999999994,6.41,16.3,9.86,5.0199999999999996,1.03,0,2.0299999999999998,985,0,0,0,0,0,6.7,0.93899999999999995,0,0]
["MC18X58","MC","F",58,17.100000000000001,18,0,0,4.2,0,0,0.7,0.625,0,0,0,1.44,1.4375,0,0.86199999999999999,0,0.69499999999999995,0.47399999999999998,0,0,0,0,0,0,675,95.4,75,6.29,17.600000000000001,10.7,5.28,1.02,0,2.81,1070,0,0,0,0,0,6.56,0.94399999999999995,0,0]
["MC3x7.1","MC","F",7.1,2.11,3,0,0,1.94,0,0,0.312,0.35099999999999998,0,0,0,0.81299999999999994,0.8125,0,0.65300000000000002,0,0.57399999999999995,0.41399999999999998,0,0,0,0,0,0,2.72,2.2400000000000002,1.81,1.1399999999999999,0.66600000000000004,0.998,0.51800000000000002,0.56200000000000006,0,9.2799999999999994E-2,0.91500000000000004,0,0,0,0,0,1.76,0.51600000000000001,0,0]
["MC4x13.8","MC","F",13.8,4.03,4,0,0,2.5,0,0,0.5,0.5,0,0,0,1,1,0,0.84899999999999998,0,0.64300000000000002,0.50800000000000001,0,0,0,0,0,0,8.85,5.53,4.43,1.48,2.13,2.4,1.29,0.72699999999999998,0,0.373,4.84,0,0,0,0,0,2.23,0.55000000000000004,0,0]
["MC6X12","MC","F",12,3.53,6,0,0,2.5,0,0,0.31,0.375,0,0,0,0.875,0.875,0,0.70399999999999996,0,0.72499999999999998,0.29399999999999998,0,0,0,0,0,0,18.7,7.47,6.24,2.2999999999999998,1.85,1.97,1.03,0.72399999999999998,0,0.155,11.3,0,0,0,0,0,2.8,0.74,0,0]
["MC6X15.1","MC","F",15.1,4.4400000000000004,6,0,0,2.94,0,0,0.316,0.47499999999999998,0,0,0,1.06,1.0625,0,0.94,0,0.98199999999999998,0.54300000000000004,0,0,0,0,0,0,24.9,9.83,8.3000000000000007,2.37,3.46,3.3,1.73,0.88300000000000001,0,0.28499999999999998,20.5,0,0,0,0,0,3.18,0.63400000000000001,0,0]
["MC6X15.3","MC","F",15.3,4.49,6,0,0,3.5,0,0,0.34,0.38500000000000001,0,0,0,0.875,0.875,0,1.05,0,1.1599999999999999,0.51100000000000001,0,0,0,0,0,0,25.3,9.91,8.44,2.38,4.91,3.85,2.0099999999999998,1.05,0,0.223,30,0,0,0,0,0,3.41,0.57899999999999996,0,0]
["MC6X16.3","MC","F",16.3,4.79,6,0,0,3,0,0,0.375,0.47499999999999998,0,0,0,1.06,1.0625,0,0.92700000000000005,0,0.93,0.46500000000000002,0,0,0,0,0,0,26,10.4,8.66,2.33,3.77,3.47,1.82,0.88700000000000001,0,0.33600000000000002,22.1,0,0,0,0,0,3.11,0.64300000000000002,0,0]
["MC6X18","MC","F",18,5.29,6,0,0,3.5,0,0,0.379,0.47499999999999998,0,0,0,1.06,1.0625,0,1.1200000000000001,0,1.17,0.64400000000000002,0,0,0,0,0,0,29.7,11.7,9.89,2.37,5.88,4.68,2.4700000000000002,1.05,0,0.379,34.6,0,0,0,0,0,3.46,0.56299999999999994,0,0]
["MC6x6.5","MC","F",6.5,1.95,6,0,0,1.85,0,0,0.155,0.29099999999999998,0,0,0,0.75,0.75,0,0.51300000000000001,0,0.61199999999999999,0.191,0,0,0,0,0,0,11,4.28,3.66,2.38,0.56499999999999995,0.83599999999999997,0.42199999999999999,0.53900000000000003,0,4.1200000000000001E-2,3.75,0,0,0,0,0,2.68,0.82399999999999995,0,0]
["MC6x7","MC","F",7,2.09,6,0,0,1.88,0,0,0.17899999999999999,0.29099999999999998,0,0,0,0.75,0.75,0,0.501,0,0.58299999999999996,0.17399999999999999,0,0,0,0,0,0,11.4,4.5,3.81,2.34,0.60299999999999998,0.86499999999999999,0.439,0.53700000000000003,0,4.6399999999999997E-2,4,0,0,0,0,0,2.63,0.83,0,0]
["MC7X19.1","MC","F",19.100000000000001,5.61,7,0,0,3.45,0,0,0.35199999999999998,0.5,0,0,0,1.1299999999999999,1.125,0,1.08,0,1.1499999999999999,0.57899999999999996,0,0,0,0,0,0,43.1,14.5,12.3,2.77,6.06,4.8499999999999996,2.5499999999999998,1.04,0,0.40699999999999997,49.3,0,0,0,0,0,3.7,0.63800000000000001,0,0]
["MC7X22.7","MC","F",22.7,6.67,7,0,0,3.6,0,0,0.503,0.5,0,0,0,1.1299999999999999,1.125,0,1.04,0,1.01,0.47699999999999998,0,0,0,0,0,0,47.4,16.399999999999999,13.5,2.67,7.24,5.38,2.83,1.04,0,0.625,58.3,0,0,0,0,0,3.53,0.65900000000000003,0,0]
["MC8X18.7","MC","F",18.7,5.5,8,0,0,2.98,0,0,0.35299999999999998,0.5,0,0,0,1.1299999999999999,1.125,0,0.84899999999999998,0,0.88900000000000001,0.34399999999999997,0,0,0,0,0,0,52.4,15.6,13.1,3.09,4.1500000000000004,3.72,1.95,0.86799999999999999,0,0.38,45,0,0,0,0,0,3.65,0.77300000000000002,0,0]
["MC8X20","MC","F",20,5.88,8,0,0,3.03,0,0,0.4,0.5,0,0,0,1.1299999999999999,1.125,0,0.84,0,0.84299999999999997,0.36699999999999999,0,0,0,0,0,0,54.4,16.399999999999999,13.6,3.04,4.42,3.86,2.02,0.86699999999999999,0,0.441,47.8,0,0,0,0,0,3.58,0.77900000000000003,0,0]
["MC8X21.4","MC","F",21.4,6.28,8,0,0,3.45,0,0,0.375,0.52500000000000002,0,0,0,1.19,1.1875,0,1.02,0,1.0900000000000001,0.45200000000000001,0,0,0,0,0,0,61.5,18.2,15.4,3.13,6.58,5.18,2.71,1.02,0,0.495,70.8,0,0,0,0,0,3.91,0.70699999999999996,0,0]
["MC8X22.8","MC","F",22.8,6.7,8,0,0,3.5,0,0,0.42699999999999999,0.52500000000000002,0,0,0,1.19,1.1875,0,1.01,0,1.04,0.41899999999999998,0,0,0,0,0,0,63.8,19.100000000000001,15.9,3.09,7.01,5.37,2.81,1.02,0,0.57199999999999995,75.2,0,0,0,0,0,3.84,0.71499999999999997,0,0]
["MC8X8.5","MC","F",8.5,2.5,8,0,0,1.87,0,0,0.17899999999999999,0.311,0,0,0,0.81299999999999994,0.8125,0,0.42799999999999999,0,0.54200000000000004,0.156,0,0,0,0,0,0,23.3,6.95,5.82,3.05,0.624,0.875,0.43099999999999999,0.5,0,5.8700000000000002E-2,8.2100000000000009,0,0,0,0,0,3.24,0.91,0,0]
["MC9X23.9","MC","F",23.9,7.02,9,0,0,3.45,0,0,0.4,0.55000000000000004,0,0,0,1.25,1.25,0,0.98099999999999998,0,1.04,0.39,0,0,0,0,0,0,84.9,22.5,18.899999999999999,3.48,7.14,5.51,2.89,1.01,0,0.59899999999999998,98,0,0,0,0,0,4.1500000000000004,0.76300000000000001,0,0]
["MC9X25.4","MC","F",25.4,7.47,9,0,0,3.5,0,0,0.45,0.55000000000000004,0,0,0,1.25,1.25,0,0.97,0,0.98599999999999999,0.41499999999999998,0,0,0,0,0,0,87.9,23.5,19.5,3.43,7.57,5.7,2.99,1.01,0,0.69099999999999995,104,0,0,0,0,0,4.08,0.77,0,0]
["S10X25.4","S","F",25.4,7.45,10,0,0,4.66,0,0,0.311,0.49099999999999999,0,0,0,1.1299999999999999,1.125,0,0,0,0,0,0,4.75,0,25.6,0,0,123,28.3,24.6,4.07,6.73,4.99,2.89,0.95,0,0.60299999999999998,152,0,11.1,6.34,5.08,14,0,0,0,0]
["S10X35","S","F",35,10.3,10,0,0,4.9400000000000004,0,0,0.59399999999999997,0.49099999999999999,0,0,0,1.1299999999999999,1.125,0,0,0,0,0,0,5.03,0,13.4,0,0,147,35.4,29.4,3.78,8.3000000000000007,6.19,3.36,0.89900000000000002,0,1.29,188,0,11.8,7.13,5.08,17.600000000000001,0,0,0,0]
["S12X31.8","S","F",31.8,9.31,12,0,0,5,0,0,0.35,0.54400000000000004,0,0,0,1.19,1.1875,0,0,0,0,0,0,4.5999999999999996,0,28.3,0,0,217,41.8,36.200000000000003,4.83,9.33,6.44,3.73,1,0,0.878,306,0,14.3,9.74,7.24,20.8,0,0,0,0]
["S12X35","S","F",35,10.199999999999999,12,0,0,5.08,0,0,0.42799999999999999,0.54400000000000004,0,0,0,1.19,1.1875,0,0,0,0,0,0,4.67,0,23.1,0,0,228,44.6,38.1,4.72,9.84,6.8,3.88,0.98,0,1.05,323,0,14.5,10,7.24,22.2,0,0,0,0]
["S12X40.8","S","F",40.799999999999997,11.9,12,0,0,5.25,0,0,0.46200000000000002,0.65900000000000003,0,0,0,1.44,1.4375,0,0,0,0,0,0,3.98,0,20.6,0,0,270,52.7,45.1,4.76,13.5,8.86,5.13,1.06,0,1.69,433,0,14.9,12.9,8.9499999999999993,26.2,0,0,0,0]
["S12X50","S","F",50,14.6,12,0,0,5.48,0,0,0.68700000000000006,0.65900000000000003,0,0,0,1.44,1.4375,0,0,0,0,0,0,4.16,0,13.7,0,0,303,60.9,50.6,4.55,15.6,10.3,5.69,1.03,0,2.77,501,0,15.5,14,8.9499999999999993,30.3,0,0,0,0]
["S15X42.9","S","F",42.9,12.6,15,0,0,5.5,0,0,0.41099999999999998,0.622,0,0,0,1.38,1.375,0,0,0,0,0,0,4.42,0,30.4,0,0,446,69.2,59.4,5.95,14.3,9.08,5.19,1.06,0,1.54,737,0,19.8,16.899999999999999,11.4,34.299999999999997,0,0,0,0]
["S15X50","S","F",50,14.7,15,0,0,5.64,0,0,0.55000000000000004,0.622,0,0,0,1.38,1.375,0,0,0,0,0,0,4.53,0,22.7,0,0,485,77,64.7,5.75,15.6,10,5.53,1.03,0,2.12,805,0,20.3,17.8,11.4,38.200000000000003,0,0,0,0]
["S18X54.7","S","F",54.7,16,18,0,0,6,0,0,0.46100000000000002,0.69099999999999995,0,0,0,1.5,1.5,0,0,0,0,0,0,4.34,0,33.200000000000003,0,0,801,104,89,7.07,20.7,12.1,6.91,1.1399999999999999,0,2.33,1550,0,26,26.9,16.600000000000001,51.8,0,0,0,0]
["S18X70","S","F",70,20.5,18,0,0,6.25,0,0,0.71099999999999997,0.69099999999999995,0,0,0,1.5,1.5,0,0,0,0,0,0,4.5199999999999996,0,21.5,0,0,923,124,103,6.7,24,14.3,7.69,1.08,0,4.0999999999999996,1800,0,27,29.2,16.600000000000001,61.9,0,0,0,0]
["S20X66","S","F",66,19.399999999999999,20,0,0,6.26,0,0,0.505,0.79500000000000004,0,0,0,1.63,1.625,0,0,0,0,0,0,3.93,0,33.5,0,0,1190,139,119,7.83,27.5,15.4,8.7799999999999994,1.19,0,3.58,2530,0,30,37.299999999999997,21.9,69.099999999999994,0,0,0,0]
["S20X75","S","F",75,22,20,0,0,6.39,0,0,0.63500000000000001,0.79500000000000004,0,0,0,1.63,1.625,0,0,0,0,0,0,4.0199999999999996,0,26.6,0,0,1280,152,128,7.62,29.5,16.7,9.25,1.1599999999999999,0,4.59,2720,0,30.7,38.9,21.9,75.599999999999994,0,0,0,0]
["S20X86","S","F",86,25.3,20.3,0,0,7.06,0,0,0.66,0.92,0,0,0,1.75,1.75,0,0,0,0,0,0,3.84,0,25.6,0,0,1570,183,155,7.89,46.6,23.1,13.2,1.36,0,6.65,4370,0,34.200000000000003,55.5,28.5,91.1,0,0,0,0]
["S20X96","S","F",96,28.2,20.3,0,0,7.2,0,0,0.8,0.92,0,0,0,1.75,1.75,0,0,0,0,0,0,3.91,0,21.1,0,0,1670,198,165,7.71,49.9,24.9,13.9,1.33,0,8.4,4690,0,34.9,57.8,28.5,98.3,0,0,0,0]
["S24X100","S","F",100,29.3,24,0,0,7.25,0,0,0.745,0.87,0,0,0,1.75,1.75,0,0,0,0,0,0,4.16,0,27.8,0,0,2380,239,199,9.01,47.4,24,13.1,1.27,0,7.59,6350,0,41.9,66,32.700000000000003,119,0,0,0,0]
["S24X106","S","F",106,31.1,24.5,0,0,7.87,0,0,0.62,1.0900000000000001,0,0,0,2,2,0,0,0,0,0,0,3.61,0,33.4,0,0,2940,279,240,9.7100000000000009,76.8,33.4,19.5,1.57,0,10.1,10500,0,46.1,98.8,46.2,139,0,0,0,0]
["S24X121","S","F",121,35.5,24.5,0,0,8.0500000000000007,0,0,0.8,1.0900000000000001,0,0,0,2,2,0,0,0,0,0,0,3.69,0,25.9,0,0,3160,306,258,9.43,83,36.299999999999997,20.6,1.53,0,12.8,11400,0,47.1,103,46.2,153,0,0,0,0]
["S24X80","S","F",80,23.5,24,0,0,7,0,0,0.5,0.87,0,0,0,1.75,1.75,0,0,0,0,0,0,4.0199999999999996,0,41.4,0,0,2100,204,175,9.4700000000000006,42,20.8,12,1.34,0,4.8899999999999997,5620,0,40.5,61.6,32.700000000000003,101,0,0,0,0]
["S24X90","S","F",90,26.5,24,0,0,7.13,0,0,0.625,0.87,0,0,0,1.75,1.75,0,0,0,0,0,0,4.09,0,33.1,0,0,2250,222,187,9.2100000000000009,44.7,22.4,12.5,1.3,0,6.05,5980,0,41.2,63.8,32.700000000000003,110,0,0,0,0]
["S3X5.7","S","F",5.7,1.66,3,0,0,2.33,0,0,0.17,0.26,0,0,0,0.625,0.625,0,0,0,0,0,0,4.4800000000000004,0,11,0,0,2.5,1.94,1.67,1.23,0.44700000000000001,0.65600000000000003,0.38300000000000001,0.51800000000000002,0,4.3299999999999998E-2,0.83799999999999997,0,1.6,0.24199999999999999,0.38500000000000001,0.96099999999999997,0,0,0,0]
["S3X7.5","S","F",7.5,2.2000000000000002,3,0,0,2.5099999999999998,0,0,0.34899999999999998,0.26,0,0,0,0.625,0.625,0,0,0,0,0,0,4.83,0,5.38,0,0,2.91,2.35,1.94,1.1499999999999999,0.57799999999999996,0.82099999999999995,0.46100000000000002,0.51300000000000001,0,8.9599999999999999E-2,1.08,0,1.72,0.28000000000000003,0.38500000000000001,1.1599999999999999,0,0,0,0]
["S4X7.7","S","F",7.7,2.2599999999999998,4,0,0,2.66,0,0,0.193,0.29299999999999998,0,0,0,0.75,0.75,0,0,0,0,0,0,4.54,0,14.1,0,0,6.05,3.5,3.03,1.64,0.748,0.97,0.56200000000000006,0.57599999999999996,0,7.3200000000000001E-2,2.57,0,2.4700000000000002,0.48099999999999998,0.67100000000000004,1.73,0,0,0,0]
["S4X9.5","S","F",9.5,2.79,4,0,0,2.8,0,0,0.32600000000000001,0.29299999999999998,0,0,0,0.75,0.75,0,0,0,0,0,0,4.7699999999999996,0,8.33,0,0,6.76,4.04,3.38,1.56,0.88700000000000001,1.1299999999999999,0.63500000000000001,0.56399999999999995,0,0.12,3.05,0,2.59,0.53100000000000003,0.67100000000000004,1.99,0,0,0,0]
["S5X10","S","F",10,2.93,5,0,0,3,0,0,0.214,0.32600000000000001,0,0,0,0.75,0.75,0,0,0,0,0,0,4.6100000000000003,0,16.8,0,0,12.3,5.66,4.9000000000000004,2.0499999999999998,1.19,1.37,0.79500000000000004,0.63800000000000001,0,0.114,6.52,0,3.51,0.85899999999999999,1.06,2.79,0,0,0,0]
["S6X12.5","S","F",12.5,3.66,6,0,0,3.33,0,0,0.23200000000000001,0.35899999999999999,0,0,0,0.81299999999999994,0.8125,0,0,0,0,0,0,4.6399999999999997,0,19.399999999999999,0,0,22,8.4499999999999993,7.34,2.4500000000000002,1.8,1.86,1.08,0.70199999999999996,0,0.16700000000000001,14.3,0,4.7,1.41,1.57,4.18,0,0,0,0]
["S6X17.2","S","F",17.3,5.0599999999999996,6,0,0,3.57,0,0,0.46500000000000002,0.35899999999999999,0,0,0,0.81299999999999994,0.8125,0,0,0,0,0,0,4.97,0,9.67,0,0,26.2,10.5,8.74,2.2799999999999998,2.29,2.35,1.28,0.67300000000000004,0,0.371,18.2,0,5.03,1.61,1.57,5.23,0,0,0,0]
["S8X18.4","S","F",18.399999999999999,5.4,8,0,0,4,0,0,0.27100000000000002,0.42499999999999999,0,0,0,1,1,0,0,0,0,0,0,4.71,0,22.9,0,0,57.5,16.5,14.4,3.26,3.69,3.18,1.84,0.82699999999999996,0,0.33500000000000002,52.9,0,7.58,3.22,3,8.17,0,0,0,0]
["S8X23","S","F",23,6.76,8,0,0,4.17,0,0,0.441,0.42499999999999999,0,0,0,1,1,0,0,0,0,0,0,4.91,0,14.1,0,0,64.7,19.2,16.2,3.09,4.2699999999999996,3.67,2.0499999999999998,0.79500000000000004,0,0.55000000000000004,61.2,0,7.9,3.5,3,9.5299999999999994,0,0,0,0]
["W10X100","W","F",100,29.4,11.1,0,0,10.3,0,0,0.68,1.1200000000000001,0,0,0,1.62,1.8125,1,0,0,0,0,0,4.62,0,11.6,0,0,623,130,112,4.5999999999999996,207,61,40,2.65,0,10.9,5150,0,25.7,74.099999999999994,26.9,64.2,0,0,0,0]
["W10X112","W","F",112,32.9,11.4,0,0,10.4,0,0,0.755,1.25,0,0,0,1.75,1.9375,1,0,0,0,0,0,4.17,0,10.4,0,0,716,147,126,4.66,236,69.2,45.3,2.68,0,15.1,6020,0,26.4,85.8,30.6,73.5,0,0,0,0]
["W10X12","W","F",12,3.54,9.8699999999999992,0,0,3.96,0,0,0.19,0.21,0,0,0,0.51,0.75,0.5625,0,0,0,0,0,9.43,0,46.6,0,0,53.8,12.6,10.9,3.9,2.1800000000000002,1.74,1.1000000000000001,0.78500000000000003,0,5.4699999999999999E-2,50.9,0,9.56,1.99,1.91,6.14,0,0,0,0]
["W10X15","W","F",15,4.41,10,0,0,4,0,0,0.23,0.27,0,0,0,0.56999999999999995,0.8125,0.5625,0,0,0,0,0,7.41,0,38.5,0,0,68.900000000000006,16,13.8,3.95,2.89,2.2999999999999998,1.45,0.81,0,0.104,68.3,0,9.73,2.63,2.48,7.83,0,0,0,0]
["W10X17","W","F",17,4.99,10.1,0,0,4.01,0,0,0.24,0.33,0,0,0,0.63,0.875,0.5625,0,0,0,0,0,6.08,0,36.9,0,0,81.900000000000006,18.7,16.2,4.05,3.56,2.8,1.78,0.84499999999999997,0,0.156,85.1,0,9.7899999999999991,3.24,3.04,9.14,0,0,0,0]
["W10X19","W","F",19,5.62,10.199999999999999,0,0,4.0199999999999996,0,0,0.25,0.39500000000000002,0,0,0,0.69499999999999995,0.9375,0.625,0,0,0,0,0,5.09,0,35.4,0,0,96.3,21.6,18.8,4.1399999999999997,4.29,3.35,2.14,0.874,0,0.23300000000000001,104,0,9.85,3.91,3.65,10.6,0,0,0,0]
["W10X22","W","F",22,6.49,10.199999999999999,0,0,5.75,0,0,0.24,0.36,0,0,0,0.66,0.9375,0.625,0,0,0,0,0,7.99,0,36.9,0,0,118,26,23.2,4.2699999999999996,11.4,6.1,3.97,1.33,0,0.23899999999999999,275,0,14.1,7.32,4.88,12.9,0,0,0,0]
["W10X26","W","F",26,7.61,10.3,0,0,5.77,0,0,0.26,0.44,0,0,0,0.74,1.0625,0.6875,0,0,0,0,0,6.56,0,34,0,0,144,31.3,27.9,4.3499999999999996,14.1,7.5,4.8899999999999997,1.36,0,0.40200000000000002,345,0,14.2,9.0299999999999994,5.98,15.4,0,0,0,0]
["W10X30","W","F",30,8.84,10.5,0,0,5.81,0,0,0.3,0.51,0,0,0,0.81,1.125,0.6875,0,0,0,0,0,5.7,0,29.5,0,0,170,36.6,32.4,4.38,16.7,8.84,5.75,1.37,0,0.622,414,0,14.5,10.7,7.02,18.2,0,0,0,0]
["W10X33","W","F",33,9.7100000000000009,9.73,0,0,7.96,0,0,0.28999999999999998,0.435,0,0,0,0.93500000000000005,1.125,0.75,0,0,0,0,0,9.15,0,27.1,0,0,171,38.799999999999997,35,4.1900000000000004,36.6,14,9.1999999999999993,1.94,0,0.58299999999999996,791,0,18.5,16,7.75,18.899999999999999,0,0,0,0]
["W10X39","W","F",39,11.5,9.92,0,0,7.99,0,0,0.315,0.53,0,0,0,1.03,1.1875,0.8125,0,0,0,0,0,7.53,0,25,0,0,209,46.8,42.1,4.2699999999999996,45,17.2,11.3,1.98,0,0.97599999999999998,992,0,18.8,19.899999999999999,9.5500000000000007,23,0,0,0,0]
["W10X45","W","F",45,13.3,10.1,0,0,8.02,0,0,0.35,0.62,0,0,0,1.1200000000000001,1.3125,0.8125,0,0,0,0,0,6.47,0,22.5,0,0,248,54.9,49.1,4.32,53.4,20.3,13.3,2.0099999999999998,0,1.51,1200,0,19,23.6,11.3,27,0,0,0,0]
["W10X49","W","F",49,14.4,10,0,0,10,0,0,0.34,0.56000000000000005,0,0,0,1.06,1.25,0.8125,0,0,0,0,0,8.93,0,23.1,0,0,272,60.4,54.6,4.3499999999999996,93.4,28.3,18.7,2.54,0,1.39,2070,0,23.6,33,12.8,29.8,0,0,0,0]
["W10X54","W","F",54,15.8,10.1,0,0,10,0,0,0.37,0.61499999999999999,0,0,0,1.1200000000000001,1.3125,0.8125,0,0,0,0,0,8.15,0,21.2,0,0,303,66.599999999999994,60,4.37,103,31.3,20.6,2.56,0,1.82,2320,0,23.7,36.5,14,32.799999999999997,0,0,0,0]
["W10X60","W","F",60,17.600000000000001,10.199999999999999,0,0,10.1,0,0,0.42,0.68,0,0,0,1.18,1.375,0.8125,0,0,0,0,0,7.41,0,18.7,0,0,341,74.599999999999994,66.7,4.3899999999999997,116,35,23,2.57,0,2.48,2640,0,24,41.3,15.7,36.799999999999997,0,0,0,0]
["W10X68","W","F",68,20,10.4,0,0,10.1,0,0,0.47,0.77,0,0,0,1.27,1.4375,0.875,0,0,0,0,0,6.58,0,16.7,0,0,394,85.3,75.7,4.4400000000000004,134,40.1,26.4,2.59,0,3.56,3100,0,24.3,47.3,17.899999999999999,42.1,0,0,0,0]
["W10X77","W","F",77,22.6,10.6,0,0,10.199999999999999,0,0,0.53,0.87,0,0,0,1.37,1.5625,0.875,0,0,0,0,0,5.86,0,14.8,0,0,455,97.6,85.9,4.49,154,45.9,30.1,2.6,0,5.1100000000000003,3630,0,24.8,55,20.5,48.4,0,0,0,0]
["W10X88","W","F",88,25.9,10.8,0,0,10.3,0,0,0.60499999999999998,0.99,0,0,0,1.49,1.6875,0.9375,0,0,0,0,0,5.18,0,13,0,0,534,113,98.5,4.54,179,53.1,34.799999999999997,2.63,0,7.53,4330,0,25.3,64.400000000000006,23.5,55.9,0,0,0,0]
["W12X106","W","F",106,31.2,12.9,0,0,12.2,0,0,0.61,0.99,0,0,0,1.59,1.875,1.125,0,0,0,0,0,6.17,0,15.9,0,0,933,164,145,5.47,301,75.099999999999994,49.3,3.11,0,9.1300000000000008,10700,0,36.299999999999997,110,34.200000000000003,81,0,0,0,0]
["W12X120","W","F",120,35.299999999999997,13.1,0,0,12.3,0,0,0.71,1.1100000000000001,0,0,0,1.7,2,1.1875,0,0,0,0,0,5.57,0,13.7,0,0,1070,186,163,5.51,345,85.4,56,3.13,0,12.9,12400,0,36.9,126,38.6,92.4,0,0,0,0]
["W12X136","W","F",136,39.9,13.4,0,0,12.4,0,0,0.79,1.25,0,0,0,1.85,2.125,1.25,0,0,0,0,0,4.96,0,12.3,0,0,1240,214,186,5.58,398,98,64.2,3.16,0,18.5,14700,0,37.700000000000003,146,44.1,106,0,0,0,0]
["W12X14","W","F",14,4.16,11.9,0,0,3.97,0,0,0.2,0.22500000000000001,0,0,0,0.52500000000000002,0.75,0.5625,0,0,0,0,0,8.82,0,54.3,0,0,88.6,17.399999999999999,14.9,4.62,2.36,1.9,1.19,0.753,0,7.0400000000000004E-2,80.400000000000006,0,11.6,2.59,2.48,8.49,0,0,0,0]
["W12X152","W","F",152,44.7,13.7,0,0,12.5,0,0,0.87,1.4,0,0,0,2,2.3125,1.25,0,0,0,0,0,4.46,0,11.2,0,0,1430,243,209,5.66,454,111,72.8,3.19,0,25.8,17200,0,38.4,168,50.1,121,0,0,0,0]
["W12X16","W","F",16,4.71,12,0,0,3.99,0,0,0.22,0.26500000000000001,0,0,0,0.56499999999999995,0.8125,0.5625,0,0,0,0,0,7.53,0,49.4,0,0,103,20.100000000000001,17.100000000000001,4.67,2.82,2.2599999999999998,1.41,0.77300000000000002,0,0.10299999999999999,96.9,0,11.7,3.09,2.93,9.82,0,0,0,0]
["W12X170","W","F",170,50,14,0,0,12.6,0,0,0.96,1.56,0,0,0,2.16,2.4375,1.3125,0,0,0,0,0,4.03,0,10.1,0,0,1650,275,235,5.74,517,126,82.3,3.22,0,35.6,20100,0,39.200000000000003,193,56.5,136,0,0,0,0]
["W12X19","W","F",19,5.57,12.2,0,0,4.01,0,0,0.23499999999999999,0.35,0,0,0,0.65,0.875,0.5625,0,0,0,0,0,5.72,0,46.2,0,0,130,24.7,21.3,4.82,3.76,2.98,1.88,0.82199999999999995,0,0.18,131,0,11.9,4.17,3.91,12.2,0,0,0,0]
["W12X190","W","F",190,55.8,14.4,0,0,12.7,0,0,1.06,1.74,0,0,0,2.33,2.625,1.375,0,0,0,0,0,3.65,0,9.16,0,0,1890,311,263,5.82,589,143,93,3.25,0,48.8,23600,0,40.200000000000003,222,64.099999999999994,156,0,0,0,0]
["W12X210","W","T",210,61.8,14.7,0,0,12.8,0,0,1.18,1.9,0,0,0,2.5,2.8125,1.4375,0,0,0,0,0,3.37,0,8.23,0,0,2140,348,292,5.89,664,159,104,3.28,0,64.7,27200,0,41,249,70.599999999999994,173,0,0,0,0]
["W12X22","W","F",22,6.48,12.3,0,0,4.03,0,0,0.26,0.42499999999999999,0,0,0,0.72499999999999998,0.9375,0.625,0,0,0,0,0,4.74,0,41.8,0,0,156,29.3,25.4,4.91,4.66,3.66,2.31,0.84799999999999998,0,0.29299999999999998,164,0,12,5.12,4.76,14.4,0,0,0,0]
["W12X230","W","T",230,67.7,15.1,0,0,12.9,0,0,1.29,2.0699999999999998,0,0,0,2.67,2.9375,1.5,0,0,0,0,0,3.11,0,7.56,0,0,2420,386,321,5.97,742,177,115,3.31,0,83.8,31200,0,42,281,78.3,193,0,0,0,0]
["W12X252","W","T",252,74,15.4,0,0,13,0,0,1.4,2.25,0,0,0,2.85,3.125,1.5,0,0,0,0,0,2.89,0,6.96,0,0,2720,428,353,6.06,828,196,127,3.34,0,108,35800,0,42.7,313,85.8,213,0,0,0,0]
["W12X26","W","F",26,7.65,12.2,0,0,6.49,0,0,0.23,0.38,0,0,0,0.68,1.0625,0.75,0,0,0,0,0,8.5399999999999991,0,47.2,0,0,204,37.200000000000003,33.4,5.17,17.3,8.17,5.34,1.51,0,0.3,607,0,19.2,11.8,7.03,18.3,0,0,0,0]
["W12X279","W","T",279,81.900000000000006,15.9,0,0,13.1,0,0,1.53,2.4700000000000002,0,0,0,3.07,3.375,1.625,0,0,0,0,0,2.66,0,6.35,0,0,3110,481,393,6.16,937,220,143,3.38,0,143,42000,0,44,356,96,240,0,0,0,0]
["W12X30","W","F",30,8.7899999999999991,12.3,0,0,6.52,0,0,0.26,0.44,0,0,0,0.74,1.125,0.75,0,0,0,0,0,7.41,0,41.8,0,0,238,43.1,38.6,5.21,20.3,9.56,6.24,1.52,0,0.45700000000000002,720,0,19.3,13.9,8.17,21.3,0,0,0,0]
["W12X305","W","T",305,89.6,16.3,0,0,13.2,0,0,1.63,2.71,0,0,0,3.3,3.625,1.625,0,0,0,0,0,2.4500000000000002,0,5.98,0,0,3550,537,435,6.29,1050,244,159,3.42,0,185,48600,0,44.8,401,107,267,0,0,0,0]
["W12X336","W","T",336,98.8,16.8,0,0,13.4,0,0,1.78,2.96,0,0,0,3.55,3.875,1.6875,0,0,0,0,0,2.2599999999999998,0,5.47,0,0,4060,603,483,6.41,1190,274,177,3.47,0,243,57000,0,46.4,460,119,301,0,0,0,0]
["W12X35","W","F",35,10.3,12.5,0,0,6.56,0,0,0.3,0.52,0,0,0,0.82,1.1875,0.75,0,0,0,0,0,6.31,0,36.200000000000003,0,0,285,51.2,45.6,5.25,24.5,11.5,7.47,1.54,0,0.74099999999999999,879,0,19.600000000000001,16.8,9.75,25.4,0,0,0,0]
["W12X40","W","F",40,11.7,11.9,0,0,8.01,0,0,0.29499999999999998,0.51500000000000001,0,0,0,1.02,1.375,0.875,0,0,0,0,0,7.77,0,33.6,0,0,307,57,51.5,5.13,44.1,16.8,11,1.94,0,0.90600000000000003,1440,0,22.8,23.5,11.3,27.8,0,0,0,0]
["W12X45","W","F",45,13.1,12.1,0,0,8.0500000000000007,0,0,0.33500000000000002,0.57499999999999996,0,0,0,1.08,1.375,0.9375,0,0,0,0,0,7,0,29.6,0,0,348,64.2,57.7,5.15,50,19,12.4,1.95,0,1.26,1650,0,23.2,26.8,12.8,31.7,0,0,0,0]
["W12X50","W","F",50,14.6,12.2,0,0,8.08,0,0,0.37,0.64,0,0,0,1.1399999999999999,1.5,0.9375,0,0,0,0,0,6.31,0,26.8,0,0,391,71.900000000000006,64.2,5.18,56.3,21.3,13.9,1.96,0,1.71,1880,0,23.4,30.2,14.3,35.4,0,0,0,0]
["W12X53","W","F",53,15.6,12.1,0,0,10,0,0,0.34499999999999997,0.57499999999999996,0,0,0,1.18,1.375,0.9375,0,0,0,0,0,8.69,0,28.1,0,0,425,77.900000000000006,70.599999999999994,5.23,95.8,29.1,19.2,2.48,0,1.58,3160,0,28.8,41.4,16,38.299999999999997,0,0,0,0]
["W12X58","W","F",58,17,12.2,0,0,10,0,0,0.36,0.64,0,0,0,1.24,1.5,0.9375,0,0,0,0,0,7.82,0,27,0,0,475,86.4,78,5.28,107,32.5,21.4,2.5099999999999998,0,2.1,3570,0,28.9,46.2,17.8,42.4,0,0,0,0]
["W12X65","W","F",65,19.100000000000001,12.1,0,0,12,0,0,0.39,0.60499999999999998,0,0,0,1.2,1.5,1,0,0,0,0,0,9.92,0,24.9,0,0,533,96.8,87.9,5.28,174,44.1,29.1,3.02,0,2.1800000000000002,5780,0,34.5,62.6,20.2,47.5,0,0,0,0]
["W12X72","W","F",72,21.1,12.3,0,0,12,0,0,0.43,0.67,0,0,0,1.27,1.5625,1.0625,0,0,0,0,0,8.99,0,22.6,0,0,597,108,97.4,5.31,195,49.2,32.4,3.04,0,2.93,6540,0,34.9,70.099999999999994,22.5,53.2,0,0,0,0]
["W12X79","W","F",79,23.2,12.4,0,0,12.1,0,0,0.47,0.73499999999999999,0,0,0,1.33,1.625,1.0625,0,0,0,0,0,8.2200000000000006,0,20.7,0,0,662,119,107,5.34,216,54.3,35.799999999999997,3.05,0,3.84,7330,0,35.299999999999997,78.5,24.9,58.9,0,0,0,0]
["W12X87","W","F",87,25.6,12.5,0,0,12.1,0,0,0.51500000000000001,0.81,0,0,0,1.41,1.6875,1.0625,0,0,0,0,0,7.48,0,18.899999999999999,0,0,740,132,118,5.38,241,60.4,39.700000000000003,3.07,0,5.0999999999999996,8270,0,35.4,86.6,27.4,64.900000000000006,0,0,0,0]
["W12X96","W","F",96,28.2,12.7,0,0,12.2,0,0,0.55000000000000004,0.9,0,0,0,1.5,1.8125,1.125,0,0,0,0,0,6.76,0,17.7,0,0,833,147,131,5.44,270,67.5,44.4,3.09,0,6.85,9410,0,36,98.8,30.9,73,0,0,0,0]
["W14X109","W","F",109,32,14.3,0,0,14.6,0,0,0.52500000000000002,0.86,0,0,0,1.46,2.1875,1.5,0,0,0,0,0,8.49,0,21.7,0,0,1240,192,173,6.22,447,92.7,61.2,3.73,0,7.12,20200,0,49.1,154,40.700000000000003,94.8,0,0,0,0]
["W14X120","W","F",120,35.299999999999997,14.5,0,0,14.7,0,0,0.59,0.94,0,0,0,1.54,2.25,1.5,0,0,0,0,0,7.8,0,19.3,0,0,1380,212,190,6.24,495,102,67.5,3.74,0,9.3699999999999992,22700,0,49.8,172,45,105,0,0,0,0]
["W14X132","W","F",132,38.799999999999997,14.7,0,0,14.7,0,0,0.64500000000000002,1.03,0,0,0,1.63,2.3125,1.5625,0,0,0,0,0,7.15,0,17.7,0,0,1530,234,209,6.28,548,113,74.5,3.76,0,12.3,25500,0,50.2,190,49.5,116,0,0,0,0]
["W14X145","W","F",145,42.7,14.8,0,0,15.5,0,0,0.68,1.0900000000000001,0,0,0,1.69,2.375,1.5625,0,0,0,0,0,7.11,0,16.8,0,0,1710,260,232,6.33,677,133,87.3,3.98,0,15.2,31700,0,53.1,224,55.4,129,0,0,0,0]
["W14X159","W","F",159,46.7,15,0,0,15.6,0,0,0.745,1.19,0,0,0,1.79,2.5,1.5625,0,0,0,0,0,6.54,0,15.3,0,0,1900,287,254,6.38,748,146,96.2,4,0,19.7,35600,0,53.9,250,61,143,0,0,0,0]
["W14X176","W","F",176,51.8,15.2,0,0,15.7,0,0,0.83,1.31,0,0,0,1.91,2.625,1.625,0,0,0,0,0,5.97,0,13.7,0,0,2140,320,281,6.43,838,163,107,4.0199999999999996,0,26.5,40500,0,54.5,280,67.599999999999994,159,0,0,0,0]
["W14X193","W","F",193,56.8,15.5,0,0,15.7,0,0,0.89,1.44,0,0,0,2.04,2.75,1.6875,0,0,0,0,0,5.45,0,12.8,0,0,2400,355,310,6.5,931,180,119,4.05,0,34.799999999999997,45900,0,55.2,312,75,177,0,0,0,0]
["W14X211","W","F",211,62,15.7,0,0,15.8,0,0,0.98,1.56,0,0,0,2.16,2.875,1.6875,0,0,0,0,0,5.0599999999999996,0,11.6,0,0,2660,390,338,6.55,1030,198,130,4.07,0,44.6,51500,0,55.9,344,81.7,194,0,0,0,0]
["W14X22","W","F",22,6.49,13.7,0,0,5,0,0,0.23,0.33500000000000002,0,0,0,0.73499999999999999,1.0625,0.75,0,0,0,0,0,7.46,0,53.3,0,0,199,33.200000000000003,29,5.54,7,4.3899999999999997,2.8,1.04,0,0.20799999999999999,314,0,16.7,7,5.34,16.100000000000001,0,0,0,0]
["W14X233","W","T",233,68.5,16,0,0,15.9,0,0,1.07,1.72,0,0,0,2.3199999999999998,3,1.75,0,0,0,0,0,4.62,0,10.7,0,0,3010,436,375,6.63,1150,221,145,4.0999999999999996,0,59.5,59000,0,56.8,388,91.1,216,0,0,0,0]
["W14X257","W","T",257,75.599999999999994,16.399999999999999,0,0,16,0,0,1.18,1.89,0,0,0,2.4900000000000002,3.1875,1.8125,0,0,0,0,0,4.2300000000000004,0,9.7100000000000009,0,0,3400,487,415,6.71,1290,246,161,4.13,0,79.099999999999994,67800,0,58,439,102,243,0,0,0,0]
["W14X26","W","F",26,7.69,13.9,0,0,5.03,0,0,0.255,0.42,0,0,0,0.82,1.125,0.75,0,0,0,0,0,5.98,0,48.1,0,0,245,40.200000000000003,35.299999999999997,5.65,8.91,5.54,3.55,1.08,0,0.35799999999999998,405,0,17,8.9499999999999993,6.76,19.7,0,0,0,0]
["W14X283","W","T",283,83.3,16.7,0,0,16.100000000000001,0,0,1.29,2.0699999999999998,0,0,0,2.67,3.375,1.875,0,0,0,0,0,3.89,0,8.84,0,0,3840,542,459,6.79,1440,274,179,4.17,0,104,77700,0,58.9,491,112,269,0,0,0,0]
["W14X30","W","F",30,8.85,13.8,0,0,6.73,0,0,0.27,0.38500000000000001,0,0,0,0.78500000000000003,1.125,0.75,0,0,0,0,0,8.74,0,45.4,0,0,291,47.3,42,5.73,19.600000000000001,8.99,5.82,1.49,0,0.38,887,0,22.6,14.6,8.34,23.1,0,0,0,0]
["W14X311","W","T",311,91.4,17.100000000000001,0,0,16.2,0,0,1.41,2.2599999999999998,0,0,0,2.86,3.5625,1.9375,0,0,0,0,0,3.59,0,8.09,0,0,4330,603,506,6.88,1610,304,199,4.2,0,136,89100,0,60.1,550,124,300,0,0,0,0]
["W14X34","W","F",34,10,14,0,0,6.75,0,0,0.28499999999999998,0.45500000000000002,0,0,0,0.85499999999999998,1.1875,0.75,0,0,0,0,0,7.41,0,43.1,0,0,340,54.6,48.6,5.83,23.3,10.6,6.91,1.53,0,0.56899999999999995,1070,0,22.9,17.600000000000001,10,26.9,0,0,0,0]
["W14X342","W","T",342,101,17.5,0,0,16.399999999999999,0,0,1.54,2.4700000000000002,0,0,0,3.07,3.75,2,0,0,0,0,0,3.31,0,7.41,0,0,4900,672,558,6.98,1810,338,221,4.24,0,178,103000,0,61.6,624,138,335,0,0,0,0]
["W14X370","W","T",370,109,17.899999999999999,0,0,16.5,0,0,1.66,2.66,0,0,0,3.26,3.9375,2.0625,0,0,0,0,0,3.1,0,6.89,0,0,5440,736,607,7.07,1990,370,241,4.2699999999999996,0,222,116000,0,62.9,690,150,367,0,0,0,0]
["W14X38","W","F",38,11.2,14.1,0,0,6.77,0,0,0.31,0.51500000000000001,0,0,0,0.91500000000000004,1.25,0.8125,0,0,0,0,0,6.57,0,39.6,0,0,385,61.5,54.6,5.87,26.7,12.1,7.88,1.55,0,0.79800000000000004,1230,0,23,20,11.3,30.3,0,0,0,0]
["W14X398","W","T",398,117,18.3,0,0,16.600000000000001,0,0,1.77,2.85,0,0,0,3.44,4.125,2.125,0,0,0,0,0,2.92,0,6.44,0,0,6000,801,656,7.16,2170,402,262,4.3099999999999996,0,273,129000,0,64.099999999999994,758,163,401,0,0,0,0]
["W14X426","W","T",426,125,18.7,0,0,16.7,0,0,1.88,3.04,0,0,0,3.63,4.3125,2.125,0,0,0,0,0,2.75,0,6.08,0,0,6600,869,706,7.26,2360,434,283,4.34,0,331,144000,0,65.400000000000006,830,176,435,0,0,0,0]
["W14X43","W","F",43,12.6,13.7,0,0,8,0,0,0.30499999999999999,0.53,0,0,0,1.1200000000000001,1.375,1,0,0,0,0,0,7.54,0,37.4,0,0,428,69.599999999999994,62.6,5.82,45.2,17.3,11.3,1.89,0,1.05,1950,0,26.3,27.9,13.4,34,0,0,0,0]
["W14X455","W","T",455,134,19,0,0,16.8,0,0,2.02,3.21,0,0,0,3.81,4.5,2.25,0,0,0,0,0,2.62,0,5.66,0,0,7190,936,756,7.33,2560,468,304,4.38,0,395,160000,0,66.3,894,187,466,0,0,0,0]
["W14X48","W","F",48,14.1,13.8,0,0,8.0299999999999994,0,0,0.34,0.59499999999999997,0,0,0,1.19,1.4375,1,0,0,0,0,0,6.75,0,33.6,0,0,484,78.400000000000006,70.2,5.85,51.4,19.600000000000001,12.8,1.91,0,1.45,2240,0,26.5,31.7,15.1,38.299999999999997,0,0,0,0]
["W14X500","W","T",500,147,19.600000000000001,0,0,17,0,0,2.19,3.5,0,0,0,4.0999999999999996,4.8125,2.3125,0,0,0,0,0,2.4300000000000002,0,5.21,0,0,8210,1050,838,7.48,2880,522,339,4.43,0,514,187000,0,68.400000000000006,1020,209,522,0,0,0,0]
["W14X53","W","F",53,15.6,13.9,0,0,8.06,0,0,0.37,0.66,0,0,0,1.25,1.5,1,0,0,0,0,0,6.11,0,30.9,0,0,541,87.1,77.8,5.89,57.7,22,14.3,1.92,0,1.94,2540,0,26.7,35.5,16.8,42.5,0,0,0,0]
["W14X550","W","T",550,162,20.2,0,0,17.2,0,0,2.38,3.82,0,0,0,4.42,5.125,2.375,0,0,0,0,0,2.25,0,4.79,0,0,9430,1180,931,7.63,3250,583,378,4.49,0,669,219000,0,70.400000000000006,1160,232,585,0,0,0,0]
["W14X605","W","T",605,178,20.9,0,0,17.399999999999999,0,0,2.6,4.16,0,0,0,4.76,5.4375,2.5,0,0,0,0,0,2.09,0,4.3899999999999997,0,0,10800,1320,1040,7.8,3680,652,423,4.55,0,869,258000,0,72.8,1320,258,657,0,0,0,0]
["W14X61","W","F",61,17.899999999999999,13.9,0,0,10,0,0,0.375,0.64500000000000002,0,0,0,1.24,1.5,1,0,0,0,0,0,7.75,0,30.4,0,0,640,102,92.1,5.98,107,32.799999999999997,21.5,2.4500000000000002,0,2.19,4710,0,33.1,53.4,20.6,50.2,0,0,0,0]
["W14X665","W","T",665,196,21.6,0,0,17.7,0,0,2.83,4.5199999999999996,0,0,0,5.12,5.8125,2.625,0,0,0,0,0,1.95,0,4.03,0,0,12400,1480,1150,7.98,4170,730,472,4.62,0,1120,305000,0,75.599999999999994,1510,287,739,0,0,0,0]
["W14X68","W","F",68,20,14,0,0,10,0,0,0.41499999999999998,0.72,0,0,0,1.31,1.5625,1.0625,0,0,0,0,0,6.97,0,27.5,0,0,722,115,103,6.01,121,36.9,24.2,2.46,0,3.01,5380,0,33.200000000000003,59.8,22.9,56,0,0,0,0]
["W14X730","W","T",730,215,22.4,0,0,17.899999999999999,0,0,3.07,4.91,0,0,0,5.51,6.1875,2.75,0,0,0,0,0,1.82,0,3.71,0,0,14300,1660,1280,8.17,4720,816,527,4.6900000000000004,0,1450,362000,0,78.3,1720,318,829,0,0,0,0]
["W14X74","W","F",74,21.8,14.2,0,0,10.1,0,0,0.45,0.78500000000000003,0,0,0,1.38,1.625,1.0625,0,0,0,0,0,6.41,0,25.4,0,0,795,126,112,6.04,134,40.5,26.6,2.48,0,3.87,5990,0,33.9,67.099999999999994,25.4,62.2,0,0,0,0]
["W14X82","W","F",82,24,14.3,0,0,10.1,0,0,0.51,0.85499999999999998,0,0,0,1.45,1.6875,1.0625,0,0,0,0,0,5.92,0,22.4,0,0,881,139,123,6.05,148,44.8,29.3,2.48,0,5.07,6710,0,33.9,73.3,27.6,68.2,0,0,0,0]
["W14X90","W","F",90,26.5,14,0,0,14.5,0,0,0.44,0.71,0,0,0,1.31,2,1.4375,0,0,0,0,0,10.199999999999999,0,25.9,0,0,999,157,143,6.14,362,75.599999999999994,49.9,3.7,0,4.0599999999999996,16000,0,48.2,124,33.200000000000003,77.099999999999994,0,0,0,0]
["W14X99","W","F",99,29.1,14.2,0,0,14.6,0,0,0.48499999999999999,0.78,0,0,0,1.38,2.0625,1.4375,0,0,0,0,0,9.34,0,23.5,0,0,1110,173,157,6.17,402,83.6,55.2,3.71,0,5.37,18000,0,49,139,36.9,86.1,0,0,0,0]
["W16X100","W","F",100,29.5,17,0,0,10.4,0,0,0.58499999999999996,0.98499999999999999,0,0,0,1.39,1.875,1.125,0,0,0,0,0,5.29,0,24.3,0,0,1490,198,175,7.1,186,54.9,35.700000000000003,2.5099999999999998,0,7.73,11900,0,41.6,107,38.700000000000003,98.5,0,0,0,0]
["W16X26","W","F",26,7.68,15.7,0,0,5.5,0,0,0.25,0.34499999999999997,0,0,0,0.747,1.0625,0.75,0,0,0,0,0,7.97,0,56.8,0,0,301,44.2,38.4,6.26,9.59,5.48,3.49,1.1200000000000001,0,0.26200000000000001,565,0,21.1,10,6.95,21.6,0,0,0,0]
["W16X31","W","F",31,9.1300000000000008,15.9,0,0,5.53,0,0,0.27500000000000002,0.44,0,0,0,0.84199999999999997,1.125,0.75,0,0,0,0,0,6.28,0,51.6,0,0,375,54,47.2,6.41,12.4,7.03,4.49,1.17,0,0.46100000000000002,739,0,21.4,13,8.94,26.6,0,0,0,0]
["W16X36","W","F",36,10.6,15.9,0,0,6.99,0,0,0.29499999999999998,0.43,0,0,0,0.83199999999999996,1.125,0.75,0,0,0,0,0,8.1199999999999992,0,48.1,0,0,448,64,56.5,6.51,24.5,10.8,7,1.52,0,0.54500000000000004,1460,0,27,20.3,11.1,31.6,0,0,0,0]
["W16X40","W","F",40,11.8,16,0,0,7,0,0,0.30499999999999999,0.505,0,0,0,0.90700000000000003,1.1875,0.8125,0,0,0,0,0,6.93,0,46.5,0,0,518,73,64.7,6.63,28.9,12.7,8.25,1.57,0,0.79400000000000004,1730,0,27.1,24,13.1,36,0,0,0,0]
["W16X45","W","F",45,13.3,16.100000000000001,0,0,7.04,0,0,0.34499999999999997,0.56499999999999995,0,0,0,0.96699999999999997,1.25,0.8125,0,0,0,0,0,6.23,0,41.1,0,0,586,82.3,72.7,6.65,32.799999999999997,14.5,9.34,1.57,0,1.1100000000000001,1990,0,27.3,27.2,14.7,40.6,0,0,0,0]
["W16X50","W","F",50,14.7,16.3,0,0,7.07,0,0,0.38,0.63,0,0,0,1.03,1.3125,0.8125,0,0,0,0,0,5.61,0,37.4,0,0,659,92,81,6.68,37.200000000000003,16.3,10.5,1.59,0,1.52,2270,0,27.7,30.8,16.5,45.6,0,0,0,0]
["W16X57","W","F",57,16.8,16.399999999999999,0,0,7.12,0,0,0.43,0.71499999999999997,0,0,0,1.1200000000000001,1.375,0.875,0,0,0,0,0,4.9800000000000004,0,33,0,0,758,105,92.2,6.72,43.1,18.899999999999999,12.1,1.6,0,2.2200000000000002,2660,0,27.9,35.5,18.8,52,0,0,0,0]
["W16X67","W","F",67,19.7,16.3,0,0,10.199999999999999,0,0,0.39500000000000002,0.66500000000000004,0,0,0,1.07,1.5625,1,0,0,0,0,0,7.7,0,35.9,0,0,954,130,117,6.96,119,35.5,23.2,2.46,0,2.39,7300,0,39.9,67.599999999999994,25.5,64.099999999999994,0,0,0,0]
["W16X77","W","F",77,22.6,16.5,0,0,10.3,0,0,0.45500000000000002,0.76,0,0,0,1.1599999999999999,1.625,1.0625,0,0,0,0,0,6.77,0,31.2,0,0,1110,150,134,7,138,41.1,26.9,2.4700000000000002,0,3.57,8590,0,40.5,79.3,29.4,74.400000000000006,0,0,0,0]
["W16X89","W","F",89,26.2,16.8,0,0,10.4,0,0,0.52500000000000002,0.875,0,0,0,1.28,1.75,1.0625,0,0,0,0,0,5.92,0,27,0,0,1300,175,155,7.05,163,48.1,31.4,2.4900000000000002,0,5.45,10200,0,41.4,94.2,34.4,87.3,0,0,0,0]
["W18X106","W","F",106,31.1,18.7,0,0,11.2,0,0,0.59,0.94,0,0,0,1.34,1.8125,1.125,0,0,0,0,0,5.96,0,27.2,0,0,1910,230,204,7.84,220,60.5,39.4,2.66,0,7.48,17400,0,49.7,131,44.3,114,0,0,0,0]
["W18X119","W","F",119,35.1,19,0,0,11.3,0,0,0.65500000000000003,1.06,0,0,0,1.46,1.9375,1.1875,0,0,0,0,0,5.31,0,24.5,0,0,2190,262,231,7.9,253,69.099999999999994,44.9,2.69,0,10.6,20300,0,50.7,152,50.6,131,0,0,0,0]
["W18X130","W","F",130,38.200000000000003,19.3,0,0,11.2,0,0,0.67,1.2,0,0,0,1.6,2.0625,1.1875,0,0,0,0,0,4.6500000000000004,0,23.9,0,0,2460,290,256,8.0299999999999994,278,76.7,49.9,2.7,0,14.5,22700,0,50.7,170,57.2,146,0,0,0,0]
["W18X143","W","F",143,42.1,19.5,0,0,11.2,0,0,0.73,1.32,0,0,0,1.72,2.1875,1.1875,0,0,0,0,0,4.25,0,22,0,0,2750,322,282,8.09,311,85.4,55.5,2.72,0,19.2,25700,0,50.9,188,62.8,160,0,0,0,0]
["W18X158","W","F",158,46.3,19.7,0,0,11.3,0,0,0.81,1.44,0,0,0,1.84,2.375,1.25,0,0,0,0,0,3.92,0,19.8,0,0,3060,356,310,8.1199999999999992,347,94.8,61.4,2.74,0,25.2,29000,0,51.6,210,69,177,0,0,0,0]
["W18X175","W","F",175,51.3,20,0,0,11.4,0,0,0.89,1.59,0,0,0,1.99,2.4375,1.25,0,0,0,0,0,3.58,0,18,0,0,3450,398,344,8.1999999999999993,391,106,68.8,2.76,0,33.799999999999997,33300,0,52.5,238,76.900000000000006,198,0,0,0,0]
["W18x192","W","F",192,56.4,20.399999999999999,0,0,11.5,0,0,0.96,1.75,0,0,0,2.15,2.4375,1.125,0,0,0,0,0,3.27,0,16.7,0,0,3870,442,380,8.2799999999999994,440,119,76.8,2.79,0,44.7,38000,0,53.6,270,86,222,0,0,0,0]
["W18x211","W","F",211,62.1,20.7,0,0,11.6,0,0,1.06,1.91,0,0,0,2.31,2.5625,1.1875,0,0,0,0,0,3.02,0,15.1,0,0,4330,490,419,8.35,493,132,85.3,2.82,0,58.6,43400,0,54.5,302,94.6,246,0,0,0,0]
["W18x234","W","T",234,68.8,21.1,0,0,11.7,0,0,1.1599999999999999,2.11,0,0,0,2.5099999999999998,2.75,1.1875,0,0,0,0,0,2.76,0,16.8,0,0,4900,549,466,8.44,558,149,95.8,2.85,0,78.7,50100,0,55.5,343,106,276,0,0,0,0]
["W18x258","W","T",258,75.900000000000006,21.5,0,0,11.8,0,0,1.28,2.2999999999999998,0,0,0,2.7,3,1.25,0,0,0,0,0,2.56,0,12.5,0,0,5510,611,514,8.5299999999999994,628,166,107,2.88,0,103,57600,0,56.6,384,116,306,0,0,0,0]
["W18x283","W","T",283,83.3,21.9,0,0,11.9,0,0,1.4,2.5,0,0,0,3,3.1875,1.3125,0,0,0,0,0,2.38,0,11.3,0,0,6170,676,565,8.61,704,185,118,2.91,0,134,65900,0,57.7,429,127,339,0,0,0,0]
["W18x311","W","T",311,91.6,22.3,0,0,12,0,0,1.52,2.74,0,0,0,3.24,3.4375,1.375,0,0,0,0,0,2.19,0,10.4,0,0,6970,754,624,8.7200000000000006,795,207,132,2.95,0,176,76200,0,58.7,482,140,375,0,0,0,0]
["W18X35","W","F",35,10.3,17.7,0,0,6,0,0,0.3,0.42499999999999999,0,0,0,0.82699999999999996,1.125,0.75,0,0,0,0,0,7.06,0,53.5,0,0,510,66.5,57.6,7.04,15.3,8.06,5.12,1.22,0,0.50600000000000001,1140,0,25.9,16.5,10.5,32.700000000000003,0,0,0,0]
["W18X40","W","F",40,11.8,17.899999999999999,0,0,6.02,0,0,0.315,0.52500000000000002,0,0,0,0.92700000000000005,1.1875,0.8125,0,0,0,0,0,5.73,0,50.9,0,0,612,78.400000000000006,68.400000000000006,7.21,19.100000000000001,10,6.35,1.27,0,0.81,1440,0,26.1,20.7,13,38.6,0,0,0,0]
["W18X46","W","F",46,13.5,18.100000000000001,0,0,6.06,0,0,0.36,0.60499999999999998,0,0,0,1.01,1.25,0.8125,0,0,0,0,0,5.01,0,44.6,0,0,712,90.7,78.8,7.25,22.5,11.7,7.43,1.29,0,1.22,1720,0,26.5,24.3,15.1,44.9,0,0,0,0]
["W18X50","W","F",50,14.7,18,0,0,7.5,0,0,0.35499999999999998,0.56999999999999995,0,0,0,0.97199999999999998,1.25,0.8125,0,0,0,0,0,6.57,0,45.2,0,0,800,101,88.9,7.38,40.1,16.600000000000001,10.7,1.65,0,1.24,3040,0,32.700000000000003,34.9,17.7,49.9,0,0,0,0]
["W18X55","W","F",55,16.2,18.100000000000001,0,0,7.53,0,0,0.39,0.63,0,0,0,1.03,1.3125,0.8125,0,0,0,0,0,5.98,0,41.1,0,0,890,112,98.3,7.41,44.9,18.5,11.9,1.67,0,1.66,3430,0,32.9,39,19.600000000000001,55.3,0,0,0,0]
["W18X60","W","F",60,17.600000000000001,18.2,0,0,7.56,0,0,0.41499999999999998,0.69499999999999995,0,0,0,1.1000000000000001,1.375,0.8125,0,0,0,0,0,5.44,0,38.700000000000003,0,0,984,123,108,7.47,50.1,20.6,13.3,1.68,0,2.17,3850,0,33.1,43.5,21.7,60.6,0,0,0,0]
["W18X65","W","F",65,19.100000000000001,18.399999999999999,0,0,7.59,0,0,0.45,0.75,0,0,0,1.1499999999999999,1.4375,0.875,0,0,0,0,0,5.0599999999999996,0,35.700000000000003,0,0,1070,133,117,7.49,54.8,22.5,14.4,1.69,0,2.73,4240,0,33.5,47.7,23.6,66.3,0,0,0,0]
["W18X71","W","F",71,20.8,18.5,0,0,7.64,0,0,0.495,0.81,0,0,0,1.21,1.5,0.875,0,0,0,0,0,4.71,0,32.4,0,0,1170,146,127,7.5,60.3,24.7,15.8,1.7,0,3.49,4700,0,33.799999999999997,52.3,25.6,72.400000000000006,0,0,0,0]
["W18X76","W","F",76,22.3,18.2,0,0,11,0,0,0.42499999999999999,0.68,0,0,0,1.08,1.5625,1.0625,0,0,0,0,0,8.11,0,37.799999999999997,0,0,1330,163,146,7.73,152,42.2,27.6,2.61,0,2.83,11700,0,48.2,90.1,31.5,80.599999999999994,0,0,0,0]
["W18X86","W","F",86,25.3,18.399999999999999,0,0,11.1,0,0,0.48,0.77,0,0,0,1.17,1.625,1.0625,0,0,0,0,0,7.2,0,33.4,0,0,1530,186,166,7.77,175,48.4,31.6,2.63,0,4.0999999999999996,13600,0,48.9,105,36,92.4,0,0,0,0]
["W18X97","W","F",97,28.5,18.600000000000001,0,0,11.1,0,0,0.53500000000000003,0.87,0,0,0,1.27,1.75,1.125,0,0,0,0,0,6.41,0,30,0,0,1750,211,188,7.82,201,55.3,36.1,2.65,0,5.86,15800,0,49.2,119,40.700000000000003,105,0,0,0,0]
["W21X101","W","F",101,29.8,21.4,0,0,12.3,0,0,0.5,0.8,0,0,0,1.3,1.6875,1.0625,0,0,0,0,0,7.68,0,37.5,0,0,2420,253,227,9.02,248,61.7,40.299999999999997,2.89,0,5.21,26200,0,63.3,156,48.6,126,0,0,0,0]
["W21X111","W","F",111,32.700000000000003,21.5,0,0,12.3,0,0,0.55000000000000004,0.875,0,0,0,1.38,1.75,1.125,0,0,0,0,0,7.05,0,34.1,0,0,2670,279,249,9.0500000000000007,274,68.2,44.5,2.9,0,6.83,29200,0,63.4,171,53,138,0,0,0,0]
["W21X122","W","F",122,35.9,21.7,0,0,12.4,0,0,0.6,0.96,0,0,0,1.46,1.8125,1.125,0,0,0,0,0,6.45,0,31.3,0,0,2960,307,273,9.09,305,75.599999999999994,49.2,2.92,0,8.98,32700,0,64.3,191,58.7,153,0,0,0,0]
["W21X132","W","F",132,38.799999999999997,21.8,0,0,12.4,0,0,0.65,1.04,0,0,0,1.54,1.9375,1.125,0,0,0,0,0,6.01,0,28.9,0,0,3220,333,295,9.1199999999999992,333,82.3,53.5,2.93,0,11.3,36000,0,64.400000000000006,206,62.8,164,0,0,0,0]
["W21X147","W","F",147,43.2,22.1,0,0,12.5,0,0,0.72,1.1499999999999999,0,0,0,1.65,2,1.1875,0,0,0,0,0,5.44,0,26.1,0,0,3630,373,329,9.17,376,92.6,60.1,2.95,0,15.4,41100,0,65.5,235,71,186,0,0,0,0]
["W21X166","W","F",166,48.8,22.5,0,0,12.4,0,0,0.75,1.36,0,0,0,1.86,2.25,1.1875,0,0,0,0,0,4.57,0,25,0,0,4280,432,380,9.36,435,108,70,2.99,0,23.6,48500,0,65.5,276,83.7,215,0,0,0,0]
["W21X182","W","F",182,53.6,22.7,0,0,12.5,0,0,0.83,1.48,0,0,0,1.98,2.375,1.25,0,0,0,0,0,4.22,0,22.6,0,0,4730,476,417,9.4,483,119,77.2,3,0,30.7,54400,0,66.3,307,91.6,237,0,0,0,0]
["W21X201","W","F",201,59.2,23,0,0,12.6,0,0,0.91,1.63,0,0,0,2.13,2.5,1.3125,0,0,0,0,0,3.86,0,20.6,0,0,5310,530,461,9.4700000000000006,542,133,86.1,3.02,0,40.9,62000,0,67.3,346,102,264,0,0,0,0]
["W21X44","W","F",44,13,20.7,0,0,6.5,0,0,0.35,0.45,0,0,0,0.95,1.125,0.8125,0,0,0,0,0,7.22,0,53.6,0,0,843,95.4,81.599999999999994,8.06,20.7,10.199999999999999,6.37,1.26,0,0.77,2110,0,32.9,24.1,14,46.8,0,0,0,0]
["W21X48","W","F",48,14.1,20.6,0,0,8.14,0,0,0.35,0.43,0,0,0,0.93,1.125,0.8125,0,0,0,0,0,9.4700000000000006,0,53.6,0,0,959,107,93,8.24,38.700000000000003,14.9,9.52,1.66,0,0.80300000000000005,3950,0,41,35.9,16.899999999999999,52.3,0,0,0,0]
["W21X50","W","F",50,14.7,20.8,0,0,6.53,0,0,0.38,0.53500000000000003,0,0,0,1.04,1.25,0.8125,0,0,0,0,0,6.1,0,49.4,0,0,984,110,94.5,8.18,24.9,12.2,7.64,1.3,0,1.1399999999999999,2570,0,33.1,28.9,16.7,53.9,0,0,0,0]
["W21X55","W","F",55,16.2,20.8,0,0,8.2200000000000006,0,0,0.375,0.52200000000000002,0,0,0,1.02,1.1875,0.8125,0,0,0,0,0,7.87,0,50,0,0,1140,126,110,8.4,48.4,18.399999999999999,11.8,1.73,0,1.24,4980,0,41.7,44.7,20.8,61.8,0,0,0,0]
["W21X57","W","F",57,16.7,21.1,0,0,6.56,0,0,0.40500000000000003,0.65,0,0,0,1.1499999999999999,1.3125,0.8125,0,0,0,0,0,5.04,0,46.3,0,0,1170,129,111,8.36,30.6,14.8,9.35,1.35,0,1.77,3190,0,33.5,35.799999999999997,20.5,63.4,0,0,0,0]
["W21X62","W","F",62,18.3,21,0,0,8.24,0,0,0.4,0.61499999999999999,0,0,0,1.1200000000000001,1.3125,0.8125,0,0,0,0,0,6.7,0,46.9,0,0,1330,144,127,8.5399999999999991,57.5,21.7,14,1.77,0,1.83,5960,0,42,53.2,24.6,71.2,0,0,0,0]
["W21X68","W","F",68,20,21.1,0,0,8.27,0,0,0.43,0.68500000000000005,0,0,0,1.19,1.375,0.875,0,0,0,0,0,6.04,0,43.6,0,0,1480,160,140,8.6,64.7,24.4,15.7,1.8,0,2.4500000000000002,6760,0,42.2,59.8,27.4,78.7,0,0,0,0]
["W21X73","W","F",73,21.5,21.2,0,0,8.3000000000000007,0,0,0.45500000000000002,0.74,0,0,0,1.24,1.4375,0.875,0,0,0,0,0,5.6,0,41.2,0,0,1600,172,151,8.64,70.599999999999994,26.6,17,1.81,0,3.02,7410,0,42.5,65.2,29.7,85,0,0,0,0]
["W21X83","W","F",83,24.3,21.4,0,0,8.36,0,0,0.51500000000000001,0.83499999999999996,0,0,0,1.34,1.5,0.875,0,0,0,0,0,5,0,36.4,0,0,1830,196,171,8.67,81.400000000000006,30.5,19.5,1.83,0,4.34,8630,0,43,75,33.700000000000003,96.8,0,0,0,0]
["W21X93","W","F",93,27.3,21.6,0,0,8.42,0,0,0.57999999999999996,0.93,0,0,0,1.43,1.625,0.9375,0,0,0,0,0,4.53,0,32.299999999999997,0,0,2070,221,192,8.6999999999999993,92.9,34.700000000000003,22.1,1.84,0,6.03,9940,0,43.5,85.2,37.700000000000003,109,0,0,0,0]
["W24X103","W","F",103,30.3,24.5,0,0,9,0,0,0.55000000000000004,0.98,0,0,0,1.48,1.875,1.125,0,0,0,0,0,4.59,0,39.200000000000003,0,0,3000,280,245,10,119,41.5,26.5,1.99,0,7.07,16600,0,52.9,117,48.7,139,0,0,0,0]
["W24X104","W","F",104,30.6,24.1,0,0,12.8,0,0,0.5,0.75,0,0,0,1.25,1.625,1.0625,0,0,0,0,0,8.5,0,43.1,0,0,3100,289,258,10.1,259,62.4,40.700000000000003,2.91,0,4.72,35200,0,74.7,179,53.9,144,0,0,0,0]
["W24X117","W","F",117,34.4,24.3,0,0,12.8,0,0,0.55000000000000004,0.85,0,0,0,1.35,1.75,1.125,0,0,0,0,0,7.53,0,39.200000000000003,0,0,3540,327,291,10.1,297,71.400000000000006,46.5,2.94,0,6.72,40800,0,75,204,61,163,0,0,0,0]
["W24X131","W","F",131,38.5,24.5,0,0,12.9,0,0,0.60499999999999998,0.96,0,0,0,1.46,1.875,1.125,0,0,0,0,0,6.7,0,35.6,0,0,4020,370,329,10.199999999999999,340,81.5,53,2.97,0,9.5,47100,0,75.900000000000006,235,69.5,184,0,0,0,0]
["W24X146","W","F",146,43,24.7,0,0,12.9,0,0,0.65,1.0900000000000001,0,0,0,1.59,2,1.125,0,0,0,0,0,5.92,0,33.200000000000003,0,0,4580,418,371,10.3,391,93.2,60.5,3.01,0,13.4,54600,0,76.099999999999994,268,78.8,207,0,0,0,0]
["W24X162","W","F",162,47.7,25,0,0,13,0,0,0.70499999999999996,1.22,0,0,0,1.72,2.125,1.1875,0,0,0,0,0,5.31,0,30.6,0,0,5170,468,414,10.4,443,105,68.400000000000006,3.05,0,18.5,62600,0,77.3,306,89.2,233,0,0,0,0]
["W24X176","W","F",176,51.7,25.2,0,0,12.9,0,0,0.75,1.34,0,0,0,1.84,2.25,1.1875,0,0,0,0,0,4.8099999999999996,0,28.7,0,0,5680,511,450,10.5,479,115,74.3,3.04,0,23.9,68400,0,76.900000000000006,333,97.1,254,0,0,0,0]
["W24X192","W","F",192,56.3,25.5,0,0,13,0,0,0.81,1.46,0,0,0,1.96,2.375,1.25,0,0,0,0,0,4.43,0,26.6,0,0,6260,559,491,10.5,530,126,81.8,3.07,0,30.8,76300,0,78.099999999999994,371,107,280,0,0,0,0]
["W24X207","W","F",207,60.7,25.7,0,0,13,0,0,0.87,1.57,0,0,0,2.0699999999999998,2.5,1.25,0,0,0,0,0,4.1399999999999997,0,24.8,0,0,6820,606,531,10.6,578,137,88.8,3.08,0,38.299999999999997,84100,0,78.400000000000006,400,115,302,0,0,0,0]
["W24X229","W","F",229,67.2,26,0,0,13.1,0,0,0.96,1.73,0,0,0,2.23,2.625,1.3125,0,0,0,0,0,3.79,0,22.5,0,0,7650,675,588,10.7,651,154,99.4,3.11,0,51.3,96100,0,79.5,450,127,336,0,0,0,0]
["W24X250","W","T",250,73.5,26.3,0,0,13.2,0,0,1.04,1.89,0,0,0,2.39,2.8125,1.375,0,0,0,0,0,3.49,0,20.7,0,0,8490,744,644,10.7,724,171,110,3.14,0,66.599999999999994,108000,0,80.599999999999994,502,140,370,0,0,0,0]
["W24X279","W","T",279,82,26.7,0,0,13.3,0,0,1.1599999999999999,2.09,0,0,0,2.59,3,1.4375,0,0,0,0,0,3.18,0,18.600000000000001,0,0,9600,835,718,10.8,823,193,124,3.17,0,90.5,125000,0,81.8,569,156,416,0,0,0,0]
["W24X306","W","T",306,89.8,27.1,0,0,13.4,0,0,1.26,2.2799999999999998,0,0,0,2.78,3.1875,1.4375,0,0,0,0,0,2.94,0,17.100000000000001,0,0,10700,922,789,10.9,919,214,137,3.2,0,117,142000,0,83.1,635,172,459,0,0,0,0]
["W24X335","W","T",335,98.4,27.5,0,0,13.5,0,0,1.38,2.48,0,0,0,2.98,3.375,1.5,0,0,0,0,0,2.73,0,15.6,0,0,11900,1020,864,11,1030,238,152,3.23,0,152,161000,0,84.4,707,188,506,0,0,0,0]
["W24X370","W","T",370,109,28,0,0,13.7,0,0,1.52,2.72,0,0,0,3.22,3.625,1.5625,0,0,0,0,0,2.5099999999999998,0,14.2,0,0,13400,1130,957,11.1,1160,267,170,3.27,0,201,186000,0,86.6,807,209,568,0,0,0,0]
["W24X55","W","F",55,16.2,23.6,0,0,7.01,0,0,0.39500000000000002,0.505,0,0,0,1.01,1.4375,1,0,0,0,0,0,6.94,0,54.6,0,0,1350,134,114,9.11,29.1,13.3,8.3000000000000007,1.34,0,1.18,3870,0,40.5,35.799999999999997,19.3,66.099999999999994,0,0,0,0]
["W24X62","W","F",62,18.2,23.7,0,0,7.04,0,0,0.43,0.59,0,0,0,1.0900000000000001,1.5,1.0625,0,0,0,0,0,5.97,0,50.1,0,0,1550,153,131,9.23,34.5,15.7,9.8000000000000007,1.38,0,1.71,4620,0,40.700000000000003,42.2,22.5,75.3,0,0,0,0]
["W24X68","W","F",68,20.100000000000001,23.7,0,0,8.9700000000000006,0,0,0.41499999999999998,0.58499999999999996,0,0,0,1.0900000000000001,1.5,1.0625,0,0,0,0,0,7.66,0,52,0,0,1830,177,154,9.5500000000000007,70.400000000000006,24.5,15.7,1.87,0,1.87,9430,0,51.8,68,28.9,87,0,0,0,0]
["W24X76","W","F",76,22.4,23.9,0,0,8.99,0,0,0.44,0.68,0,0,0,1.18,1.5625,1.0625,0,0,0,0,0,6.61,0,49,0,0,2100,200,176,9.69,82.5,28.6,18.399999999999999,1.92,0,2.68,11100,0,52.2,79.8,33.799999999999997,98.9,0,0,0,0]
["W24X84","W","F",84,24.7,24.1,0,0,9.02,0,0,0.47,0.77,0,0,0,1.27,1.6875,1.0625,0,0,0,0,0,5.86,0,45.9,0,0,2370,224,196,9.7899999999999991,94.4,32.6,20.9,1.95,0,3.7,12800,0,52.6,91.3,38.4,111,0,0,0,0]
["W24X94","W","F",94,27.7,24.3,0,0,9.07,0,0,0.51500000000000001,0.875,0,0,0,1.38,1.75,1.0625,0,0,0,0,0,5.18,0,41.9,0,0,2700,254,222,9.8699999999999992,109,37.5,24,1.98,0,5.26,15000,0,53.1,105,43.8,126,0,0,0,0]
["W27X102","W","F",102,30,27.1,0,0,10,0,0,0.51500000000000001,0.83,0,0,0,1.43,1.75,1.0625,0,0,0,0,0,6.03,0,47.1,0,0,3620,305,267,11,139,43.4,27.8,2.15,0,5.28,24000,0,65.7,136,51.7,151,0,0,0,0]
["W27X114","W","F",114,33.5,27.3,0,0,10.1,0,0,0.56999999999999995,0.93,0,0,0,1.53,1.8125,1.125,0,0,0,0,0,5.41,0,42.5,0,0,4080,343,299,11,159,49.3,31.5,2.1800000000000002,0,7.33,27600,0,66.599999999999994,156,58.4,170,0,0,0,0]
["W27X129","W","F",129,37.799999999999997,27.6,0,0,10,0,0,0.61,1.1000000000000001,0,0,0,1.7,2,1.125,0,0,0,0,0,4.55,0,39.700000000000003,0,0,4760,395,345,11.2,184,57.6,36.799999999999997,2.21,0,11.1,32500,0,66.3,182,68.400000000000006,195,0,0,0,0]
["W27X146","W","F",146,43.1,27.4,0,0,14,0,0,0.60499999999999998,0.97499999999999998,0,0,0,1.76,1.875,1.125,0,0,0,0,0,7.16,0,39.4,0,0,5660,464,414,11.5,443,97.7,63.5,3.2,0,11.3,77200,0,92.5,316,86.3,229,0,0,0,0]
["W27X161","W","F",161,47.6,27.6,0,0,14,0,0,0.66,1.08,0,0,0,1.87,2,1.1875,0,0,0,0,0,6.49,0,36.1,0,0,6310,515,458,11.5,497,109,70.900000000000006,3.23,0,15.1,87300,0,92.8,351,95.5,254,0,0,0,0]
["W27X178","W","F",178,52.5,27.8,0,0,14.1,0,0,0.72499999999999998,1.19,0,0,0,1.98,2.0625,1.1875,0,0,0,0,0,5.92,0,32.9,0,0,7020,570,505,11.6,555,122,78.8,3.25,0,20.100000000000001,98400,0,93.8,393,106,282,0,0,0,0]
["W27X194","W","F",194,57.2,28.1,0,0,14,0,0,0.75,1.34,0,0,0,2.13,2.25,1.1875,0,0,0,0,0,5.24,0,31.8,0,0,7860,631,559,11.7,619,136,88.1,3.29,0,27.1,111000,0,93.7,439,119,312,0,0,0,0]
["W27X217","W","F",217,64,28.4,0,0,14.1,0,0,0.83,1.5,0,0,0,2.29,2.375,1.25,0,0,0,0,0,4.71,0,28.7,0,0,8910,711,627,11.8,704,154,100,3.32,0,37.6,128000,0,94.8,501,134,351,0,0,0,0]
["W27X235","W","F",235,69.400000000000006,28.7,0,0,14.2,0,0,0.91,1.61,0,0,0,2.4,2.5,1.3125,0,0,0,0,0,4.41,0,26.2,0,0,9700,772,677,11.8,769,168,108,3.33,0,47,141000,0,96.2,550,145,384,0,0,0,0]
["W27X258","W","F",258,76,29,0,0,14.3,0,0,0.98,1.77,0,0,0,2.56,2.6875,1.3125,0,0,0,0,0,4.03,0,24.4,0,0,10800,852,745,11.9,859,187,120,3.36,0,61.6,159000,0,97.3,616,160,424,0,0,0,0]
["W27X281","W","T",281,82.9,29.3,0,0,14.4,0,0,1.06,1.93,0,0,0,2.72,2.8125,1.375,0,0,0,0,0,3.72,0,22.5,0,0,11900,936,814,12,953,206,133,3.39,0,79.5,178000,0,98.5,685,176,466,0,0,0,0]
["W27X307","W","T",307,90.4,29.6,0,0,14.4,0,0,1.1599999999999999,2.09,0,0,0,2.88,3,1.4375,0,0,0,0,0,3.46,0,20.6,0,0,13100,1030,887,12,1050,227,146,3.41,0,101,199000,0,99,745,190,508,0,0,0,0]
["W27X336","W","T",336,98.9,30,0,0,14.6,0,0,1.26,2.2799999999999998,0,0,0,3.07,3.1875,1.4375,0,0,0,0,0,3.19,0,18.899999999999999,0,0,14600,1130,972,12.1,1180,252,162,3.45,0,131,226000,0,101,842,211,563,0,0,0,0]
["W27X368","W","T",368,108,30.4,0,0,14.7,0,0,1.38,2.48,0,0,0,3.27,3.375,1.5,0,0,0,0,0,2.96,0,17.3,0,0,16200,1240,1060,12.2,1310,279,179,3.48,0,170,255000,0,103,935,231,621,0,0,0,0]
["W27X539","W","T",539,159,32.5,0,0,15.3,0,0,1.97,3.54,0,0,0,4.33,4.4375,1.8125,0,0,0,0,0,2.15,0,12.1,0,0,25600,1890,1570,12.7,2110,437,277,3.65,0,496,443000,0,111,1500,342,943,0,0,0,0]
["W27X84","W","F",84,24.8,26.7,0,0,10,0,0,0.46,0.64,0,0,0,1.24,1.5625,1.0625,0,0,0,0,0,7.78,0,52.7,0,0,2850,244,213,10.7,106,33.200000000000003,21.2,2.0699999999999998,0,2.81,17900,0,65.2,104,39.799999999999997,121,0,0,0,0]
["W27X94","W","F",94,27.7,26.9,0,0,10,0,0,0.49,0.745,0,0,0,1.34,1.625,1.0625,0,0,0,0,0,6.7,0,49.5,0,0,3270,278,243,10.9,124,38.799999999999997,24.8,2.12,0,4.03,21300,0,65.400000000000006,122,46.3,137,0,0,0,0]
["W30X108","W","F",108,31.7,29.8,0,0,10.5,0,0,0.54500000000000004,0.76,0,0,0,1.41,1.6875,1.125,0,0,0,0,0,6.89,0,49.6,0,0,4470,346,299,11.9,146,43.9,27.9,2.15,0,4.99,30900,0,76.2,152,54.9,170,0,0,0,0]
["W30X116","W","F",116,34.200000000000003,30,0,0,10.5,0,0,0.56499999999999995,0.85,0,0,0,1.5,1.75,1.125,0,0,0,0,0,6.17,0,47.8,0,0,4930,378,329,12,164,49.2,31.3,2.19,0,6.43,34900,0,76.5,171,61.5,187,0,0,0,0]
["W30X124","W","F",124,36.5,30.2,0,0,10.5,0,0,0.58499999999999996,0.93,0,0,0,1.58,1.8125,1.125,0,0,0,0,0,5.65,0,46.2,0,0,5360,408,355,12.1,181,54,34.4,2.23,0,7.99,38600,0,76.8,188,67.5,202,0,0,0,0]
["W30X132","W","F",132,38.9,30.3,0,0,10.5,0,0,0.61499999999999999,1,0,0,0,1.65,1.875,1.125,0,0,0,0,0,5.27,0,43.9,0,0,5770,437,380,12.2,196,58.4,37.200000000000003,2.25,0,9.7200000000000006,42100,0,76.900000000000006,202,72.400000000000006,215,0,0,0,0]
["W30X148","W","F",148,43.5,30.7,0,0,10.5,0,0,0.65,1.18,0,0,0,1.83,2.0625,1.125,0,0,0,0,0,4.4400000000000004,0,41.6,0,0,6680,500,436,12.4,227,68,43.3,2.2799999999999998,0,14.5,49400,0,77.5,240,85.8,248,0,0,0,0]
["W30X173","W","F",173,51,30.4,0,0,15,0,0,0.65500000000000003,1.07,0,0,0,1.85,2,1.125,0,0,0,0,0,7.04,0,40.799999999999997,0,0,8230,607,541,12.7,598,123,79.8,3.42,0,15.6,129000,0,110,441,113,301,0,0,0,0]
["W30X191","W","F",191,56.3,30.7,0,0,15,0,0,0.71,1.19,0,0,0,1.97,2.0625,1.1875,0,0,0,0,0,6.35,0,37.700000000000003,0,0,9200,675,600,12.8,673,138,89.5,3.46,0,21,146000,0,111,494,125,335,0,0,0,0]
["W30X211","W","F",211,62.2,30.9,0,0,15.1,0,0,0.77500000000000002,1.32,0,0,0,2.1,2.25,1.1875,0,0,0,0,0,5.74,0,34.5,0,0,10300,751,665,12.9,757,155,100,3.49,0,28.4,166000,0,112,556,140,372,0,0,0,0]
["W30X235","W","F",235,69.2,31.3,0,0,15.1,0,0,0.83,1.5,0,0,0,2.29,2.375,1.25,0,0,0,0,0,5.0199999999999996,0,32.200000000000003,0,0,11700,847,748,13,855,175,114,3.51,0,40.299999999999997,190000,0,112,637,159,421,0,0,0,0]
["W30X261","W","F",261,76.900000000000006,31.6,0,0,15.2,0,0,0.93,1.65,0,0,0,2.44,2.5625,1.3125,0,0,0,0,0,4.59,0,28.7,0,0,13100,943,829,13.1,959,196,127,3.53,0,54.1,215000,0,114,714,176,469,0,0,0,0]
["W30X292","W","T",292,85.9,32,0,0,15.3,0,0,1.02,1.85,0,0,0,2.64,2.75,1.3125,0,0,0,0,0,4.12,0,26.2,0,0,14900,1060,930,13.2,1100,223,144,3.58,0,75.2,250000,0,115,816,199,529,0,0,0,0]
["W30X326","W","T",326,95.8,32.4,0,0,15.4,0,0,1.1399999999999999,2.0499999999999998,0,0,0,2.84,2.9375,1.375,0,0,0,0,0,3.75,0,23.4,0,0,16800,1190,1040,13.2,1240,252,162,3.6,0,103,287000,0,117,922,222,593,0,0,0,0]
["W30X357","W","T",357,105,32.799999999999997,0,0,15.5,0,0,1.24,2.2400000000000002,0,0,0,3.03,3.125,1.4375,0,0,0,0,0,3.45,0,21.6,0,0,18700,1320,1140,13.3,1390,279,179,3.64,0,134,324000,0,118,1030,244,655,0,0,0,0]
["W30X391","W","T",391,115,33.200000000000003,0,0,15.6,0,0,1.36,2.44,0,0,0,3.23,3.375,1.5,0,0,0,0,0,3.19,0,19.7,0,0,20700,1450,1250,13.4,1550,310,198,3.67,0,173,366000,0,120,1140,267,722,0,0,0,0]
["W30X90","W","F",90,26.4,29.5,0,0,10.4,0,0,0.47,0.61,0,0,0,1.26,1.5,1.0625,0,0,0,0,0,8.52,0,57.5,0,0,3610,283,245,11.7,115,34.700000000000003,22.1,2.09,0,2.84,24000,0,75.099999999999994,119,43.7,139,0,0,0,0]
["W30X99","W","F",99,29.1,29.7,0,0,10.5,0,0,0.52,0.67,0,0,0,1.32,1.5625,1.0625,0,0,0,0,0,7.8,0,51.9,0,0,3990,312,269,11.7,128,38.6,24.5,2.1,0,3.77,26800,0,76.2,134,48.5,154,0,0,0,0]
["W33X118","W","F",118,34.700000000000003,32.9,0,0,11.5,0,0,0.55000000000000004,0.74,0,0,0,1.44,1.625,1.125,0,0,0,0,0,7.76,0,54.5,0,0,5900,415,359,13,187,51.3,32.6,2.3199999999999998,0,5.3,48300,0,92.5,197,65.099999999999994,205,0,0,0,0]
["W33X130","W","F",130,38.299999999999997,33.1,0,0,11.5,0,0,0.57999999999999996,0.85499999999999998,0,0,0,1.56,1.75,1.125,0,0,0,0,0,6.73,0,51.7,0,0,6710,467,406,13.2,218,59.5,37.9,2.39,0,7.37,56600,0,92.7,228,75.3,230,0,0,0,0]
["W33X141","W","F",141,41.6,33.299999999999997,0,0,11.5,0,0,0.60499999999999998,0.96,0,0,0,1.66,1.8125,1.125,0,0,0,0,0,6.01,0,49.6,0,0,7450,514,448,13.4,246,66.900000000000006,42.7,2.4300000000000002,0,9.6999999999999993,64400,0,93,257,84.6,253,0,0,0,0]
["W33X152","W","F",152,44.8,33.5,0,0,11.6,0,0,0.63500000000000001,1.06,0,0,0,1.76,1.9375,1.125,0,0,0,0,0,5.48,0,47.2,0,0,8160,559,487,13.5,273,73.900000000000006,47.2,2.4700000000000002,0,12.4,71700,0,94.1,289,94.3,278,0,0,0,0]
["W33X169","W","F",169,49.5,33.799999999999997,0,0,11.5,0,0,0.67,1.22,0,0,0,1.92,2.125,1.1875,0,0,0,0,0,4.71,0,44.7,0,0,9290,629,549,13.7,310,84.4,53.9,2.5,0,17.7,82400,0,93.7,329,108,311,0,0,0,0]
["W33X201","W","F",201,59.2,33.700000000000003,0,0,15.7,0,0,0.71499999999999997,1.1499999999999999,0,0,0,1.94,2,1.1875,0,0,0,0,0,6.85,0,41.7,0,0,11600,773,686,14,749,147,95.2,3.56,0,20.8,198000,0,128,577,140,382,0,0,0,0]
["W33X221","W","F",221,65.2,33.9,0,0,15.8,0,0,0.77500000000000002,1.28,0,0,0,2.06,2.125,1.1875,0,0,0,0,0,6.2,0,38.5,0,0,12900,857,759,14.1,840,164,106,3.59,0,27.8,224000,0,129,647,156,423,0,0,0,0]
["W33X241","W","F",241,71,34.200000000000003,0,0,15.9,0,0,0.83,1.4,0,0,0,2.19,2.25,1.25,0,0,0,0,0,5.66,0,35.9,0,0,14200,940,831,14.1,933,182,118,3.62,0,36.200000000000003,251000,0,130,726,173,467,0,0,0,0]
["W33X263","W","F",263,77.5,34.5,0,0,15.8,0,0,0.87,1.57,0,0,0,2.36,2.4375,1.25,0,0,0,0,0,5.03,0,34.299999999999997,0,0,15900,1040,919,14.3,1040,202,131,3.66,0,48.7,281000,0,130,807,193,515,0,0,0,0]
["W33X291","W","F",291,85.7,34.799999999999997,0,0,15.9,0,0,0.96,1.73,0,0,0,2.52,2.625,1.3125,0,0,0,0,0,4.5999999999999996,0,31,0,0,17700,1160,1020,14.4,1160,226,146,3.68,0,65.099999999999994,319000,0,131,904,214,573,0,0,0,0]
["W33X318","W","T",318,93.6,35.200000000000003,0,0,16,0,0,1.04,1.89,0,0,0,2.68,2.75,1.3125,0,0,0,0,0,4.2300000000000004,0,28.7,0,0,19500,1270,1110,14.5,1290,250,161,3.71,0,84.4,357000,0,133,1010,235,632,0,0,0,0]
["W33X354","W","T",354,104,35.6,0,0,16.100000000000001,0,0,1.1599999999999999,2.09,0,0,0,2.88,2.9375,1.375,0,0,0,0,0,3.85,0,25.7,0,0,22000,1420,1240,14.5,1460,282,181,3.74,0,115,408000,0,135,1130,262,707,0,0,0,0]
["W33X387","W","T",387,114,36,0,0,16.2,0,0,1.26,2.2799999999999998,0,0,0,3.07,3.1875,1.4375,0,0,0,0,0,3.55,0,23.7,0,0,24300,1560,1350,14.6,1620,312,200,3.77,0,148,459000,0,137,1260,287,778,0,0,0,0]
["W36X135","W","F",135,39.700000000000003,35.6,0,0,12,0,0,0.6,0.79,0,0,0,1.54,1.6875,1.125,0,0,0,0,0,7.56,0,54.1,0,0,7800,509,439,14,225,59.7,37.700000000000003,2.38,0,7,68100,0,104,245,77.900000000000006,251,0,0,0,0]
["W36X150","W","F",150,44.2,35.9,0,0,12,0,0,0.625,0.94,0,0,0,1.69,1.875,1.125,0,0,0,0,0,6.37,0,51.9,0,0,9040,581,504,14.3,270,70.900000000000006,45.1,2.4700000000000002,0,10.1,82200,0,105,294,93.1,287,0,0,0,0]
["W36X160","W","F",160,47,36,0,0,12,0,0,0.65,1.02,0,0,0,1.77,1.9375,1.125,0,0,0,0,0,5.88,0,49.9,0,0,9760,624,542,14.4,295,77.3,49.1,2.5,0,12.4,90200,0,105,321,101,308,0,0,0,0]
["W36X170","W","F",170,50.1,36.200000000000003,0,0,12,0,0,0.68,1.1000000000000001,0,0,0,1.85,2,1.1875,0,0,0,0,0,5.47,0,47.7,0,0,10500,668,581,14.5,320,83.8,53.2,2.5299999999999998,0,15.1,98500,0,105,349,109,330,0,0,0,0]
["W36X182","W","F",182,53.6,36.299999999999997,0,0,12.1,0,0,0.72499999999999998,1.18,0,0,0,1.93,2.125,1.1875,0,0,0,0,0,5.12,0,44.8,0,0,11300,718,623,14.5,347,90.7,57.6,2.5499999999999998,0,18.5,107000,0,106,378,118,355,0,0,0,0]
["W36X194","W","F",194,57,36.5,0,0,12.1,0,0,0.76500000000000001,1.26,0,0,0,2.0099999999999998,2.1875,1.1875,0,0,0,0,0,4.8099999999999996,0,42.4,0,0,12100,767,664,14.6,375,97.7,61.9,2.56,0,22.2,116000,0,107,407,126,379,0,0,0,0]
["W36X210","W","F",210,61.8,36.700000000000003,0,0,12.2,0,0,0.83,1.36,0,0,0,2.11,2.3125,1.25,0,0,0,0,0,4.4800000000000004,0,39.1,0,0,13200,833,719,14.6,411,107,67.5,2.58,0,28,128000,0,108,446,136,412,0,0,0,0]
["W36X231","W","F",230,68.099999999999994,36.5,0,0,16.5,0,0,0.76,1.26,0,0,0,2.21,2.5625,1.5625,0,0,0,0,0,6.54,0,42.2,0,0,15600,963,854,15.1,940,176,114,3.71,0,28.7,292000,0,145,756,175,476,0,0,0,0]
["W36X232","W","F",232,68.099999999999994,37.1,0,0,12.1,0,0,0.87,1.57,0,0,0,2.3199999999999998,2.4375,1.25,0,0,0,0,0,3.86,0,37.299999999999997,0,0,15000,936,809,14.8,468,122,77.2,2.62,0,39.6,148000,0,108,512,157,464,0,0,0,0]
["W36X247","W","F",247,72.5,36.700000000000003,0,0,16.5,0,0,0.8,1.35,0,0,0,2.2999999999999998,2.625,1.625,0,0,0,0,0,6.11,0,40.1,0,0,16700,1030,913,15.2,1010,190,123,3.74,0,34.700000000000003,316000,0,146,812,187,509,0,0,0,0]
["W36X256","W","F",256,75.400000000000006,37.4,0,0,12.2,0,0,0.96,1.73,0,0,0,2.48,2.625,1.3125,0,0,0,0,0,3.53,0,33.799999999999997,0,0,16800,1040,895,14.9,528,137,86.5,2.65,0,52.9,168000,0,109,576,174,516,0,0,0,0]
["W36X262","W","F",262,77,36.9,0,0,16.600000000000001,0,0,0.84,1.44,0,0,0,2.39,2.75,1.625,0,0,0,0,0,5.75,0,38.200000000000003,0,0,17900,1100,972,15.3,1090,204,132,3.76,0,41.6,342000,0,147,873,200,543,0,0,0,0]
["W36X282","W","F",282,82.9,37.1,0,0,16.600000000000001,0,0,0.88500000000000001,1.57,0,0,0,2.52,2.875,1.625,0,0,0,0,0,5.29,0,36.200000000000003,0,0,19600,1190,1050,15.4,1200,223,144,3.8,0,52.7,378000,0,147,960,219,591,0,0,0,0]
["W36X302","W","F",302,88.8,37.299999999999997,0,0,16.7,0,0,0.94499999999999995,1.68,0,0,0,2.63,3,1.6875,0,0,0,0,0,4.96,0,33.9,0,0,21100,1280,1130,15.4,1300,241,156,3.82,0,64.3,412000,0,148,1040,235,635,0,0,0,0]
["W36X330","W","F",330,97,37.700000000000003,0,0,16.600000000000001,0,0,1.02,1.85,0,0,0,2.8,3.125,1.75,0,0,0,0,0,4.49,0,31.4,0,0,23300,1410,1240,15.5,1420,265,171,3.83,0,84.3,456000,0,149,1150,259,698,0,0,0,0]
["W36X361","W","T",361,106,38,0,0,16.7,0,0,1.1200000000000001,2.0099999999999998,0,0,0,2.96,3.3125,1.75,0,0,0,0,0,4.16,0,28.6,0,0,25700,1550,1350,15.6,1570,293,188,3.85,0,109,509000,0,150,1270,282,767,0,0,0,0]
["W36X395","W","T",395,116,38.4,0,0,16.8,0,0,1.22,2.2000000000000002,0,0,0,3.15,3.4375,1.8125,0,0,0,0,0,3.83,0,26.3,0,0,28500,1710,1490,15.7,1750,325,208,3.88,0,142,575000,0,152,1410,311,847,0,0,0,0]
["W36X441","W","T",442,130,38.9,0,0,17,0,0,1.36,2.44,0,0,0,3.39,3.75,1.875,0,0,0,0,0,3.48,0,23.6,0,0,32100,1910,1650,15.7,1990,368,235,3.92,0,194,661000,0,154,1600,347,950,0,0,0,0]
["W36X487","W","T",487,143,39.299999999999997,0,0,17.100000000000001,0,0,1.5,2.68,0,0,0,3.63,4,1.875,0,0,0,0,0,3.19,0,21.4,0,0,36000,2130,1830,15.8,2250,412,263,3.96,0,258,754000,0,157,1800,383,1060,0,0,0,0]
["W36X529","W","T",529,156,39.799999999999997,0,0,17.2,0,0,1.61,2.91,0,0,0,3.86,4.1875,2,0,0,0,0,0,2.96,0,19.899999999999999,0,0,39600,2330,1990,16,2490,454,289,4,0,327,846000,0,159,1990,419,1160,0,0,0,0]
["W36X652","W","T",652,192,41.1,0,0,17.600000000000001,0,0,1.97,3.54,0,0,0,4.49,4.8125,2.1875,0,0,0,0,0,2.48,0,16.3,0,0,50600,2910,2460,16.2,3230,581,367,4.0999999999999996,0,593,1130000,0,165,2560,518,1450,0,0,0,0]
["W36X800","W","T",800,236,42.6,0,0,18,0,0,2.38,4.29,0,0,0,5.24,5.5625,2.375,0,0,0,0,0,2.1,0,13.5,0,0,64700,3650,3040,16.600000000000001,4200,743,467,4.22,0,1060,1540000,0,172,3320,641,1820,0,0,0,0]
["W40X149","W","F",149,43.8,38.200000000000003,0,0,11.8,0,0,0.63,0.83,0,0,0,2.0099999999999998,2.125,1.5,0,0,0,0,0,7.11,0,54.3,0,0,9800,598,513,15,229,62.2,38.799999999999997,2.29,0,9.36,80000,0,110,270,86.7,288,0,0,0,0]
["W40X167","W","F",167,49.2,38.6,0,0,11.8,0,0,0.65,1.03,0,0,0,2.21,2.3125,1.5625,0,0,0,0,0,5.76,0,52.6,0,0,11600,693,600,15.3,283,76,47.9,2.4,0,14,99700,0,111,336,107,336,0,0,0,0]
["W40X183","W","F",183,53.3,39,0,0,11.8,0,0,0.65,1.2,0,0,0,2.38,2.5,1.5625,0,0,0,0,0,4.92,0,52.6,0,0,13200,774,675,15.7,331,88.3,56,2.4900000000000002,0,19.3,118000,0,112,395,126,376,0,0,0,0]
["W40X199","W","F",199,58.5,38.700000000000003,0,0,15.8,0,0,0.65,1.07,0,0,0,2.25,2.3125,1.5625,0,0,0,0,0,7.39,0,52.6,0,0,14900,869,770,16,695,137,88.2,3.45,0,18.3,246000,0,149,628,153,427,0,0,0,0]
["W40X211","W","F",211,62,39.4,0,0,11.8,0,0,0.75,1.42,0,0,0,2.6,2.6875,1.5625,0,0,0,0,0,4.17,0,45.6,0,0,15500,906,786,15.8,390,105,66.099999999999994,2.5099999999999998,0,30.4,141000,0,112,468,148,442,0,0,0,0]
["W40X215","W","F",215,63.4,39,0,0,15.8,0,0,0.65,1.22,0,0,0,2.4,2.5,1.5625,0,0,0,0,0,6.45,0,52.6,0,0,16700,964,859,16.2,796,156,101,3.54,0,24.8,284000,0,149,719,175,473,0,0,0,0]
["W40X235","W","F",235,69,39.700000000000003,0,0,11.9,0,0,0.83,1.58,0,0,0,2.76,2.875,1.625,0,0,0,0,0,3.77,0,41.2,0,0,17400,1010,875,15.9,444,118,74.599999999999994,2.54,0,41.3,161000,0,113,530,166,495,0,0,0,0]
["W40X249","W","F",249,73.3,39.4,0,0,15.8,0,0,0.75,1.42,0,0,0,2.6,2.6875,1.5625,0,0,0,0,0,5.55,0,45.6,0,0,19600,1120,993,16.3,926,182,118,3.55,0,38.1,334000,0,150,841,203,551,0,0,0,0]
["W40X264","W","F",264,77.599999999999994,40,0,0,11.9,0,0,0.96,1.73,0,0,0,2.91,3,1.6875,0,0,0,0,0,3.45,0,35.6,0,0,19400,1130,971,15.8,493,132,82.6,2.52,0,56.1,181000,0,114,589,182,555,0,0,0,0]
["W40X277","W","F",277,81.400000000000006,39.700000000000003,0,0,15.8,0,0,0.83,1.58,0,0,0,2.76,2.875,1.625,0,0,0,0,0,5.03,0,41.2,0,0,21900,1250,1100,16.399999999999999,1040,204,132,3.58,0,51.5,379000,0,151,940,225,614,0,0,0,0]
["W40X278","W","F",278,82,40.200000000000003,0,0,12,0,0,1.03,1.81,0,0,0,2.99,3.0625,1.75,0,0,0,0,0,3.31,0,33.299999999999997,0,0,20500,1190,1020,15.8,521,140,87.1,2.52,0,65,192000,0,115,622,190,587,0,0,0,0]
["W40X294","W","F",294,86.3,40.4,0,0,12,0,0,1.06,1.93,0,0,0,3.11,3.1875,1.75,0,0,0,0,0,3.11,0,32.200000000000003,0,0,21900,1270,1080,15.9,562,150,93.5,2.5499999999999998,0,76.599999999999994,208000,0,115,668,203,622,0,0,0,0]
["W40X297","W","F",297,87.4,39.799999999999997,0,0,15.8,0,0,0.93,1.65,0,0,0,2.83,2.9375,1.6875,0,0,0,0,0,4.8,0,36.799999999999997,0,0,23200,1330,1170,16.3,1090,215,138,3.54,0,61.2,399000,0,151,982,234,652,0,0,0,0]
["W40X324","W","F",324,95.3,40.200000000000003,0,0,15.9,0,0,1,1.81,0,0,0,2.99,3.0625,1.6875,0,0,0,0,0,4.4000000000000004,0,34.200000000000003,0,0,25600,1460,1280,16.399999999999999,1220,239,153,3.58,0,79.400000000000006,448000,0,153,1100,259,720,0,0,0,0]
["W40X327","W","T",327,96,40.799999999999997,0,0,12.1,0,0,1.18,2.13,0,0,0,3.31,3.375,1.8125,0,0,0,0,0,2.85,0,29,0,0,24500,1410,1200,16,640,170,105,2.58,0,103,239000,0,117,754,225,695,0,0,0,0]
["W40X331","W","T",331,97.5,40.799999999999997,0,0,12.2,0,0,1.22,2.13,0,0,0,3.31,3.375,1.8125,0,0,0,0,0,2.86,0,28,0,0,24700,1430,1210,15.9,644,172,106,2.57,0,105,241000,0,118,766,226,706,0,0,0,0]
["W40X362","W","T",362,107,40.6,0,0,16,0,0,1.1200000000000001,2.0099999999999998,0,0,0,3.19,3.25,1.75,0,0,0,0,0,3.99,0,30.5,0,0,28900,1640,1420,16.5,1380,270,173,3.6,0,109,513000,0,154,1240,289,808,0,0,0,0]
["W40X372","W","T",372,109,40.6,0,0,16.100000000000001,0,0,1.1599999999999999,2.0499999999999998,0,0,0,3.23,3.3125,1.8125,0,0,0,0,0,3.93,0,29.5,0,0,29600,1680,1460,16.5,1420,277,177,3.6,0,116,528000,0,155,1280,295,829,0,0,0,0]
["W40X392","W","T",392,115,41.6,0,0,12.4,0,0,1.42,2.52,0,0,0,3.7,3.8125,1.9375,0,0,0,0,0,2.4500000000000002,0,24.1,0,0,29900,1710,1440,16.100000000000001,803,212,130,2.64,0,172,306000,0,121,946,270,848,0,0,0,0]
["W40X397","W","T",397,117,41,0,0,16.100000000000001,0,0,1.22,2.2000000000000002,0,0,0,3.38,3.5,1.8125,0,0,0,0,0,3.66,0,28,0,0,32000,1800,1560,16.600000000000001,1540,300,191,3.64,0,142,579000,0,156,1380,318,891,0,0,0,0]
["W40X431","W","T",431,127,41.3,0,0,16.2,0,0,1.34,2.36,0,0,0,3.54,3.625,1.875,0,0,0,0,0,3.44,0,25.5,0,0,34800,1960,1690,16.600000000000001,1690,328,208,3.65,0,177,638000,0,158,1510,341,969,0,0,0,0]
["W40X503","W","T",503,148,42.1,0,0,16.399999999999999,0,0,1.54,2.76,0,0,0,3.94,4,2,0,0,0,0,0,2.98,0,22.3,0,0,41600,2320,1980,16.8,2040,394,249,3.72,0,277,789000,0,161,1830,403,1150,0,0,0,0]
["W40X593","W","T",593,174,43,0,0,16.7,0,0,1.79,3.23,0,0,0,4.41,4.5,2.125,0,0,0,0,0,2.58,0,19.100000000000001,0,0,50400,2760,2340,17,2520,481,302,3.8,0,445,997000,0,166,2240,479,1370,0,0,0,0]
["W44X230","W","F",230,67.7,42.9,0,0,15.8,0,0,0.71,1.22,0,0,0,2.0099999999999998,2.0625,1.1875,0,0,0,0,0,6.45,0,54.8,0,0,20800,1100,971,17.5,796,157,101,3.43,0,24.9,346000,0,165,793,192,547,0,0,0,0]
["W44X262","W","F",262,76.900000000000006,43.3,0,0,15.8,0,0,0.78500000000000003,1.42,0,0,0,2.2000000000000002,2.25,1.1875,0,0,0,0,0,5.57,0,49.6,0,0,24100,1270,1110,17.7,923,182,117,3.47,0,37.299999999999997,405000,0,165,928,223,630,0,0,0,0]
["W44X290","W","F",290,85.4,43.6,0,0,15.8,0,0,0.86499999999999999,1.58,0,0,0,2.36,2.4375,1.25,0,0,0,0,0,5.0199999999999996,0,45,0,0,27000,1410,1240,17.8,1040,205,132,3.49,0,50.9,461000,0,166,1040,248,701,0,0,0,0]
["W44X335","W","F",335,98.5,44,0,0,15.9,0,0,1.03,1.77,0,0,0,2.56,2.625,1.3125,0,0,0,0,0,4.5,0,38,0,0,31100,1620,1410,17.8,1200,236,150,3.49,0,74.7,535000,0,168,1180,278,805,0,0,0,0]
["W4X13","W","F",13,3.83,4.16,0,0,4.0599999999999996,0,0,0.28000000000000003,0.34499999999999997,0,0,0,0.59499999999999997,0.75,0.5,0,0,0,0,0,5.88,0,10.6,0,0,11.3,6.28,5.46,1.72,3.86,2.92,1.9,1,0,0.151,14,0,3.87,1.36,1.24,3.09,0,0,0,0]
["W5X16","W","F",16,4.71,5.01,0,0,5,0,0,0.24,0.36,0,0,0,0.66,0.75,0.4375,0,0,0,0,0,6.94,0,15.4,0,0,21.4,9.6300000000000008,8.5500000000000007,2.13,7.51,4.58,3,1.26,0,0.192,40.6,0,5.81,2.62,1.99,4.74,0,0,0,0]
["W5X19","W","F",19,5.56,5.15,0,0,5.03,0,0,0.27,0.43,0,0,0,0.73,0.8125,0.4375,0,0,0,0,0,5.85,0,13.7,0,0,26.3,11.6,10.199999999999999,2.17,9.1300000000000008,5.53,3.63,1.28,0,0.316,50.9,0,5.94,3.21,2.42,5.73,0,0,0,0]
["W6X12","W","F",12,3.55,6.03,0,0,4,0,0,0.23,0.28000000000000003,0,0,0,0.53,0.75,0.5625,0,0,0,0,0,7.14,0,21.6,0,0,22.1,8.3000000000000007,7.31,2.4900000000000002,2.99,2.3199999999999998,1.5,0.91800000000000004,0,9.0300000000000005E-2,24.7,0,5.75,1.61,1.52,4.08,0,0,0,0]
["W6X15","W","F",15,4.43,5.99,0,0,5.99,0,0,0.23,0.26,0,0,0,0.51,0.75,0.5625,0,0,0,0,0,11.5,0,21.2,0,0,29.1,10.8,9.7200000000000006,2.56,9.32,4.75,3.11,1.45,0,0.10100000000000001,76.5,0,8.58,3.34,2.15,5.32,0,0,0,0]
["W6X16","W","F",16,4.74,6.28,0,0,4.03,0,0,0.26,0.40500000000000003,0,0,0,0.65500000000000003,0.875,0.5625,0,0,0,0,0,4.9800000000000004,0,19.100000000000001,0,0,32.1,11.7,10.199999999999999,2.6,4.43,3.39,2.2000000000000002,0.96699999999999997,0,0.223,38.200000000000003,0,5.92,2.42,2.2400000000000002,5.77,0,0,0,0]
["W6X20","W","F",20,5.87,6.2,0,0,6.02,0,0,0.26,0.36499999999999999,0,0,0,0.61499999999999999,0.875,0.5625,0,0,0,0,0,8.25,0,18.7,0,0,41.4,15,13.4,2.66,13.3,6.72,4.41,1.5,0,0.24,113,0,8.7799999999999994,4.82,3.07,7.38,0,0,0,0]
["W6X25","W","F",25,7.34,6.38,0,0,6.08,0,0,0.32,0.45500000000000002,0,0,0,0.70499999999999996,0.9375,0.5625,0,0,0,0,0,6.68,0,15.5,0,0,53.4,18.899999999999999,16.7,2.7,17.100000000000001,8.56,5.61,1.52,0,0.46100000000000002,150,0,9.01,6.23,3.88,9.39,0,0,0,0]
["W6X8.5","W","F",8.5,2.52,5.83,0,0,3.94,0,0,0.17,0.19500000000000001,0,0,0,0.44500000000000001,0.6875,0.5,0,0,0,0,0,10.1,0,29.1,0,0,14.9,5.73,5.0999999999999996,2.4300000000000002,1.99,1.56,1.01,0.89,0,3.3300000000000003E-2,15.8,0,5.55,1.06,1.03,2.78,0,0,0,0]
["W6X9","W","F",9,2.68,5.9,0,0,3.94,0,0,0.17,0.215,0,0,0,0.46500000000000002,0.6875,0.5,0,0,0,0,0,9.16,0,29.2,0,0,16.399999999999999,6.23,5.56,2.4700000000000002,2.2000000000000002,1.72,1.1100000000000001,0.90500000000000003,0,4.0500000000000001E-2,17.7,0,5.6,1.19,1.1499999999999999,3.04,0,0,0,0]
["W8X10","W","F",10,2.96,7.89,0,0,3.94,0,0,0.17,0.20499999999999999,0,0,0,0.505,0.6875,0.5,0,0,0,0,0,9.61,0,40.5,0,0,30.8,8.8699999999999992,7.81,3.22,2.09,1.66,1.06,0.84099999999999997,0,4.2599999999999999E-2,30.9,0,7.57,1.53,1.48,4.29,0,0,0,0]
["W8X13","W","F",13,3.84,7.99,0,0,4,0,0,0.23,0.255,0,0,0,0.55500000000000005,0.75,0.5625,0,0,0,0,0,7.84,0,29.9,0,0,39.6,11.4,9.91,3.21,2.73,2.15,1.37,0.84299999999999997,0,8.7099999999999997E-2,40.799999999999997,0,7.74,1.97,1.86,5.55,0,0,0,0]
["W8X15","W","F",15,4.4400000000000004,8.11,0,0,4.01,0,0,0.245,0.315,0,0,0,0.61499999999999999,0.8125,0.5625,0,0,0,0,0,6.37,0,28.1,0,0,48,13.6,11.8,3.29,3.41,2.67,1.7,0.876,0,0.13700000000000001,51.8,0,7.81,2.4700000000000002,2.31,6.64,0,0,0,0]
["W8X18","W","F",18,5.26,8.14,0,0,5.25,0,0,0.23,0.33,0,0,0,0.63,0.8125,0.5625,0,0,0,0,0,7.95,0,29.9,0,0,61.9,17,15.2,3.43,7.97,4.66,3.04,1.23,0,0.17199999999999999,122,0,10.3,4.4400000000000004,3.23,8.3699999999999992,0,0,0,0]
["W8X21","W","F",21,6.16,8.2799999999999994,0,0,5.27,0,0,0.25,0.4,0,0,0,0.7,0.875,0.5625,0,0,0,0,0,6.59,0,27.5,0,0,75.3,20.399999999999999,18.2,3.49,9.77,5.69,3.71,1.26,0,0.28199999999999997,152,0,10.4,5.47,3.96,10.1,0,0,0,0]
["W8X24","W","F",24,7.08,7.93,0,0,6.5,0,0,0.245,0.4,0,0,0,0.79400000000000004,0.875,0.5625,0,0,0,0,0,8.1199999999999992,0,25.9,0,0,82.7,23.1,20.9,3.42,18.3,8.57,5.63,1.61,0,0.34599999999999997,259,0,12.2,7.95,4.71,11.3,0,0,0,0]
["W8X28","W","F",28,8.24,8.06,0,0,6.54,0,0,0.28499999999999998,0.46500000000000002,0,0,0,0.85899999999999999,0.9375,0.625,0,0,0,0,0,7.03,0,22.3,0,0,98,27.2,24.3,3.45,21.7,10.1,6.63,1.62,0,0.53700000000000003,312,0,12.4,9.44,5.52,13.4,0,0,0,0]
["W8X31","W","F",31,9.1199999999999992,8,0,0,8,0,0,0.28499999999999998,0.435,0,0,0,0.82899999999999996,1.125,0.75,0,0,0,0,0,9.19,0,22.3,0,0,110,30.4,27.5,3.47,37.1,14.1,9.27,2.02,0,0.53600000000000003,530,0,15.1,13.2,6.35,15,0,0,0,0]
["W8X35","W","F",35,10.3,8.1199999999999992,0,0,8.02,0,0,0.31,0.495,0,0,0,0.88900000000000001,1.1875,0.8125,0,0,0,0,0,8.1,0,20.5,0,0,127,34.700000000000003,31.2,3.51,42.6,16.100000000000001,10.6,2.0299999999999998,0,0.76900000000000002,619,0,15.3,15.2,7.28,17.100000000000001,0,0,0,0]
["W8X40","W","F",40,11.7,8.25,0,0,8.07,0,0,0.36,0.56000000000000005,0,0,0,0.95399999999999996,1.25,0.8125,0,0,0,0,0,7.21,0,17.600000000000001,0,0,146,39.799999999999997,35.5,3.53,49.1,18.5,12.2,2.04,0,1.1200000000000001,726,0,15.5,17.5,8.3000000000000007,19.7,0,0,0,0]
["W8X48","W","F",48,14.1,8.5,0,0,8.11,0,0,0.4,0.68500000000000005,0,0,0,1.08,1.375,0.8125,0,0,0,0,0,5.92,0,15.9,0,0,184,49,43.2,3.61,60.9,22.9,15,2.08,0,1.96,931,0,15.8,22,10.3,24.2,0,0,0,0]
["W8X58","W","F",58,17.100000000000001,8.75,0,0,8.2200000000000006,0,0,0.51,0.81,0,0,0,1.2,1.5,0.875,0,0,0,0,0,5.07,0,12.4,0,0,228,59.8,52,3.65,75.099999999999994,27.9,18.3,2.1,0,3.33,1180,0,16.3,27.2,12.4,29.7,0,0,0,0]
["W8X67","W","F",67,19.7,9,0,0,8.2799999999999994,0,0,0.56999999999999995,0.93500000000000005,0,0,0,1.33,1.625,0.9375,0,0,0,0,0,4.43,0,11.1,0,0,272,70.099999999999994,60.4,3.72,88.6,32.700000000000003,21.4,2.12,0,5.05,1440,0,16.7,32.299999999999997,14.5,34.799999999999997,0,0,0,0]